{"text_format":"1","workbook":"xlsx","n_sheets":6,"sheets":["Anleitung","Musterschließanlagen","Schließplan","Artikelliste","Mechanisch","Elektronik"],"not_rendered":{"charts":0,"images":35,"macros":1,"external_links":0,"defined_names":10,"comments":2,"pivot_tables":0},"unopened":[],"bounds":{"document_bytes":16777216,"sheet_cells":100000,"rows_first":2000,"rows_last":500,"rows_between":2000,"halvings":0,"cell_chars":16384,"cell_head_chars":4096},"cells_cut":0,"cells_raw":0,"read":"whole","date_system":"1900"}

{"sheet":"Anleitung","index":0,"n_rows":448,"n_cols":6,"rows_kept":448,"cut":false,"hidden":false,"merged":[[0,0,0,7],[7,0,7,7],[8,0,8,7],[18,0,18,7]]}
["W   I   L   K   A       -       V   O   R   S   P   R   U   N   G       D  U   R   C   H       Q   U   A   L   I   T   Ä   T"]
[]
[]
[]
[]
[]
[]
["WILKA-Schließplan - Erfassung im Excel-Format"]
["Anleitung"]
[]
[]
["Der WILKA-Excel-Schließplan ist mit vielen Funktionen ausgestattet, die Ihnen das Erstellen eines Schließplanes"]
["vereinfachern sollen."]
[]
["Auf den nachstehenden Seiten erhalten Sie eine Übersicht über die Funktionen des WILKA-Excel-Schließplanes."]
[]
["Bei Fragen oder Anregungen zu dem Excelschließplan senden Sie uns bitte eine E-Mail an:"]
[]
["schliessanlagen@wilka.de"]
[]
[]
[null,"Inhaltsverzeichnis"]
[]
[]
[null,"Einleitung",null,null,null,"Seite   1"]
[null,"1. Musterschließanlagen",null,null,null,"Seite   1"]
[null,"2. Schließplan",null,null,null,"Seite   2"]
[null,"    2.1 Systemauswahl",null,null,null,"Seite   3"]
[null,"    2.2 Anlagenart",null,null,null,"Seite   3"]
[null,"    2.3 Artikelauswahl",null,null,null,"Seite   4"]
[null,"    2.4 Färbungen und Sonderausstattungen",null,null,null,"Seite   5"]
[null,"3. Artikelliste",null,null,null,"Seite   6"]
[null,"4. Massenermittlung",null,null,null,"Seite   7"]
[null,"    4.1 Massenermittlung als Angebotsformular",null,null,null,"Seite   9"]
[null,"5. Sonderfunktion mit Makro",null,null,null,"Seite 10"]
[null,"    5.1 Markierten Bereich drucken",null,null,null,"Seite 10"]
[null,"    5.2 Schließplanversand per E-Mail",null,null,null,"Seite 11"]
[]
[]
[]
[]
[]
[]
[]
[]
[]
[]
[]
[]
[]
[]
[]
[]
[]
[]
[]
[]
[]
[]
["Einleitung"]
[]
["Der WILKA-Excel-Schließplan dient zur Erfassung Ihres Schließplanes mit allen in Excel vorhandenen"]
["Funktionen. Sie haben hier die Möglichkeit fünf Tabellen mit besonderen Features auszuwählen."]
["Die einzelnen Tabellen erreichen Sie durch Auswahl eines Karteireiters im unteren Teil des Bildschirmes."]
[]
[]
[]
[]
[]
["1. Musterschließanlagen"]
[]
["Für jede gängige Schließanlagenart haben wir eine Musterschließanlage hinterlegt. Durch Klick des Dropdown-Pfeiles"]
["öffnet sich eine Auswahl aller vorhandenen Schließanlagenarten."]
[]
[]
[]
[]
[]
[]
[]
[]
[]
[]
[]
[]
[]
[]
[]
[]
[]
[]
[]
[]
[]
[]
[]
[]
[]
[]
[]
[]
[]
[]
[]
[]
[]
[]
[]
["Nach Auswahl einer Schließanlagenart wird Ihnen eine entsprechende Musterschließanlage angezeigt."]
["Hier können Sie die Schreibweise von übergeordneten Schlüsseln und Zentral- bzw. Mitschließungsfunktionen"]
["entnehmen."]
[]
[]
[]
[]
[]
[]
[]
[]
[]
[]
[]
[]
[]
[]
[]
[]
["2. Schließplan"]
[]
["Der WILKA-Excel-Schließplan ist wie der ausgedruckte WILKA-Werksplan aufgebaut. Erfassen Sie hier"]
["Ihre Schließanlage mit Schließungsnummern, Türnummern, Raumbezeichnungen, Stückzahlen Zylinder und "]
["Schlüssel, Artikel, Längen und Ausführungen. Geben Sie den einzelnen Zylindern die gewünschten Funktionen."]
[]
[]
[]
[]
[]
[]
[]
[]
[]
[]
[]
[]
[]
[]
[]
[]
[]
[]
[]
[]
[]
[]
[]
[]
[]
[]
["2.1 Systemauswahl"]
[]
["Entscheiden Sie vor der Eingabe in welchem Schließanlagensystem die Anlage bestellt werden soll. Durch"]
["Klick auf den Pfeil erscheinen in einem Dropdown-Menü alle verfügbaren Systeme."]
[]
[]
[]
[]
[]
[]
[]
[]
[]
[]
[]
[]
[]
[]
[]
[]
[]
[]
[]
[]
["2.2 Anlagenart"]
[]
["Wie bei der Systemauswahl können Sie auch hier über ein Dropdown-Menü Ihre Wunschanlagenart auswählen."]
[]
[]
[]
[]
[]
[]
[]
[]
[]
[]
[]
[]
[]
[]
[]
[]
[]
[]
[]
[]
[]
[]
[]
[]
[]
["2.3 Artikelauswahl"]
[]
["In jeder Zelle unter Artikel haben Sie ein Dropdown-Menü in dem Sie den entsprechenen Artikel auswählen können."]
["Wenn Ihnen die WILKA-Artikel geläufig sind können Sie diese natürlich auch händisch einpflegen."]
[]
[]
[]
[]
[]
[]
[]
[]
[]
[]
[]
[]
[]
[]
[]
[]
[]
[]
[]
[]
[]
[]
[]
[]
[]
[]
[]
[]
[]
[]
[]
["WICHTIG !!! Bevor Sie mit der Artikeleinpflege starten, wählen Sie Ihr gewünschtes Anlagensystem aus."]
["Die Artikelliste bezieht sich immer auf das gewählte System. Bei falscher Artikeleingabe erscheint "]
["eine Fehlermeldung."]
[]
[]
[]
[]
[]
[]
[]
[]
[]
[]
[]
[]
[]
[]
[]
[]
[]
[]
[]
[]
[]
[]
[]
[]
[]
[]
[]
[]
[]
[]
[]
[]
[]
["2.4 Färbungen und Zusatzausstattungen"]
[]
["In der Artikelliste sind neben den WILKA-Artikeln auch die möglichen Färbungen und ein Auszug aus den "]
["gängigen Zusatzausstattungen aufgeführt. Entnehmen Sie hier die entsprechenden Kurzbezeichnungen und"]
["tragen Sie diese in der Position bei der Spalte Färbung bzw. ZAS (Zusatzausstattung) ein."]
[]
[]
[]
[]
[]
[]
[]
[]
[]
[]
[]
[]
[]
[]
[]
[]
[]
[]
["3. Artikelliste"]
[]
["In der Artikelliste sind alle Schließanlagensysteme hinterlegt. Die Artikel sind nach Zylinderart (wie z.B. Doppel-,"]
["Halb-, Knaufzylinder usw.) aufgeführt. Wählen Sie den gewünschten Zylindertyp aus der nebenstehenden "]
["Beschreibung und suchen in der Spalte System die Artikelbezeichnung."]
[]
["In unserem nachstehenden Beispiel suchen wir einen Profildoppelzylinder mit Not- und Gefahrenfunktion im "]
["Wendeschlüssel-System 3VE."]
[]
[]
[]
[]
[]
[]
[]
[]
[]
[]
[]
[]
[]
[]
[]
[]
["Neben den aufgeführten Artikeltypen finden Sie hier auch die gängigen Zylinderfärbungen und -zusatzausstattungen."]
["Auch diese sind Systemabhängig aufgelistet und die Machbarkeit wird durch ein \"X\" gekennzeichnet."]
[]
[]
[]
[]
[]
[]
[]
[]
[]
[]
[]
[]
[]
[]
[]
[]
[]
[]
[]
[]
[]
[]
[]
[]
[]
["4. Sonderfunktionen mit Makro"]
[]
["Der WILKA-Excel-Schließplan enthält Sonderfunktionen die über ein Makro aktiviert werden. Um diese Funktionen"]
["nutzen zu können, müssen Sie in Ihrer Excelversion die Sicherheitsfunktion von Makros anpassen. "]
[]
[]
["4.1 Markierten Bereich drucken"]
[]
["Markieren Sie in Ihrem Schließplan den zu druckenden Bereich."]
[]
[]
[]
[]
[]
[]
[]
[]
[]
[]
[]
[]
[]
[]
[]
[]
[]
[]
[]
[]
[]
[]
[]
[]
[]
["Klicken Sie dann mit der Maus auf den Button \"Markierten Bereich drucken\" und der ausgewählte Schließplan-"]
["bereich wird auf Ihrem ausgewählten Standarddrucker ausgedruckt."]
[]
[]
[]
["4.2 Schließplanversand per E-Mail"]
[]
["Nach Fertigstellung des Schließplanes haben Sie die Möglichkeit diesen per E-Mail weiterzuleiten. Betätigen Sie"]
["hierfür den Button \"Versand per E-Mail\" "]
[]
["Es erscheint automatisch die Aufforderung den Schließplan zu speichern. Es wäre sinnvoll einen Ordner "]
["Schließanlagen (oder ähnlich) anzulegen, in dem Sie Ihre Schließpläne hinterlegen können. Geben Sie "]
["Ihrem Schließplan einen entsprechenden Namen und speichern diesen."]
["Nach dem Speichervorgang öffnet sich Ihr E-Mail-Fenster mit der Datei im Anhang. Bitte beachten Sie hier,"]
["es handelt sich hierbei nur um den reinen Schließplan, die Tabellen Anleitung, Musterschließanlagen, Artikellisten"]
["und Massenermittlung sind aufgrund der Größe nicht mehr vorhanden."]
["Sollten Sie jedoch alle Daten weiter benötigen, drücken Sie \"Speichern unter\" in Ihrer Excelversion und geben"]
["der Datei einen Namen. Die Datei WILKA-Schließplan… ist standardmäßig schreibgeschützt und kann nicht "]
["überschrieben werden."]
[]
[]
[]
[]
[]
[]
["Speichern Sie Ihre Datei wie beschrieben."]
[]
[]
[]
[]
[]
["Die Tabellen Anleitung, Musterschließanlagen, Artikelliste und Massenermittlung werden aufgrund der Dateigröße"]
["für den E-Mail-Versand gelöscht."]
[]
[]
[]
[]
[]
[]
[]
[]
[]
[]
[]
[]
[]
[]
[]
[]
[]
[]
[]
[]
[]
[]
[]
[]
["Es öffnet sich Ihr E-Mail-Programm mit der Excel-Schließplandatei im Anhang. Standardmäßig ist die E-Mail-"]
["Adresse schliessanlagen@wilka.de hinterlegt."]

{"sheet":"Musterschließanlagen","index":1,"n_rows":18,"n_cols":135,"rows_kept":18,"cut":false,"hidden":false,"merged":[[0,33,1,33],[0,34,1,34],[0,35,1,35],[0,36,1,36],[0,29,1,29],[0,30,1,30],[0,31,1,31],[0,32,1,32],[0,25,1,25],[0,26,1,26],[0,27,1,27],[0,28,1,28],[0,53,1,53],[0,54,1,54],[0,55,1,55],[0,56,1,56],[0,49,1,49],[0,50,1,50],[0,51,1,51],[0,52,1,52],[0,45,1,45],[0,46,1,46],[0,47,1,47],[0,48,1,48],[0,41,1,41],[0,42,1,42],[0,43,1,43],[0,44,1,44],[0,37,1,37],[0,38,1,38],[0,39,1,39],[0,40,1,40],[0,73,1,73],[0,74,1,74],[0,75,1,75],[0,76,1,76],[0,69,1,69],[0,70,1,70],[0,71,1,71],[0,72,1,72],[0,65,1,65],[0,66,1,66],[0,67,1,67],[0,68,1,68],[0,61,1,61],[0,62,1,62],[0,63,1,63],[0,64,1,64],[0,57,1,57],[0,58,1,58],[0,59,1,59],[0,60,1,60],[0,93,1,93],[0,94,1,94],[0,95,1,95],[0,96,1,96],[0,89,1,89],[0,90,1,90],[0,91,1,91],[0,92,1,92],[0,85,1,85],[0,86,1,86],[0,87,1,87],[0,88,1,88],[0,81,1,81],[0,82,1,82],[0,83,1,83],[0,84,1,84],[0,77,1,77],[0,78,1,78],[0,79,1,79],[0,80,1,80],[0,115,1,115],[0,116,1,116],[0,109,1,109],[0,110,1,110],[0,111,1,111],[0,112,1,112],[0,105,1,105],[0,106,1,106],[0,107,1,107],[0,108,1,108],[0,101,1,101],[0,102,1,102],[0,103,1,103],[0,104,1,104],[0,97,1,97],[0,98,1,98],[0,99,1,99],[0,100,1,100],[0,133,1,133],[0,134,1,134],[0,121,1,121],[0,122,1,122],[0,123,1,123],[0,124,1,124],[2,5,2,6],[2,25,10,25],[2,26,7,26],[2,27,7,27],[2,28,7,28],[2,29,7,29],[8,5,8,6],[8,13,8,24],[8,26,10,26],[8,27,10,27],[2,30,7,30],[2,31,7,31],[0,129,1,129],[0,130,1,130],[0,131,1,131],[0,132,1,132],[0,125,1,125],[0,126,1,126],[0,127,1,127],[0,128,1,128],[0,117,1,117],[0,118,1,118],[0,119,1,119],[0,120,1,120],[0,113,1,113],[0,114,1,114],[2,48,7,48],[2,49,7,49],[2,50,7,50],[2,51,7,51],[2,44,7,44],[2,45,7,45],[2,46,7,46],[2,47,7,47],[2,40,7,40],[2,41,7,41],[2,42,7,42],[2,43,7,43],[2,36,7,36],[2,37,7,37],[2,38,7,38],[2,39,7,39],[2,32,7,32],[2,33,7,33],[2,34,7,34],[2,35,7,35],[2,68,7,68],[2,69,7,69],[2,70,7,70],[2,71,7,71],[2,64,7,64],[2,65,7,65],[2,66,7,66],[2,67,7,67],[2,60,7,60],[2,61,7,61],[2,62,7,62],[2,63,7,63],[2,56,7,56],[2,57,7,57],[2,58,7,58],[2,59,7,59],[2,52,7,52],[2,53,7,53],[2,54,7,54],[2,55,7,55],[2,88,7,88],[2,89,7,89],[2,90,7,90],[2,91,7,91],[2,84,7,84],[2,85,7,85],[2,86,7,86],[2,87,7,87],[2,80,7,80],[2,81,7,81],[2,82,7,82],[2,83,7,83],[2,76,7,76],[2,77,7,77],[2,78,7,78],[2,79,7,79],[2,72,7,72],[2,73,7,73],[2,74,7,74],[2,75,7,75],[2,108,7,108],[2,109,7,109],[2,110,7,110],[2,111,7,111],[2,104,7,104],[2,105,7,105],[2,106,7,106],[2,107,7,107],[2,100,7,100],[2,101,7,101],[2,102,7,102],[2,103,7,103],[2,96,7,96],[2,97,7,97],[2,98,7,98],[2,99,7,99],[2,92,7,92],[2,93,7,93],[2,94,7,94],[2,95,7,95],[8,32,10,32],[8,33,10,33],[8,34,10,34],[8,35,10,35],[8,28,10,28],[8,29,10,29],[8,30,10,30],[8,31,10,31],[11,13,11,14],[11,15,11,16],[11,19,11,20],[2,124,7,124],[3,5,3,6],[4,5,4,11],[5,5,5,11],[5,13,5,24],[6,5,6,11],[6,13,6,24],[7,5,7,11],[7,13,7,24],[2,120,7,120],[2,121,7,121],[2,122,7,122],[2,123,7,123],[2,116,7,116],[2,117,7,117],[2,118,7,118],[2,119,7,119],[2,112,7,112],[2,113,7,113],[2,114,7,114],[2,115,7,115],[8,52,10,52],[8,53,10,53],[8,54,10,54],[8,55,10,55],[8,48,10,48],[8,49,10,49],[8,50,10,50],[8,51,10,51],[8,44,10,44],[8,45,10,45],[8,46,10,46],[8,47,10,47],[8,40,10,40],[8,41,10,41],[8,42,10,42],[8,43,10,43],[8,36,10,36],[8,37,10,37],[8,38,10,38],[8,39,10,39],[8,72,10,72],[8,73,10,73],[8,74,10,74],[8,75,10,75],[8,68,10,68],[8,69,10,69],[8,70,10,70],[8,71,10,71],[8,64,10,64],[8,65,10,65],[8,66,10,66],[8,67,10,67],[8,60,10,60],[8,61,10,61],[8,62,10,62],[8,63,10,63],[8,56,10,56],[8,57,10,57],[8,58,10,58],[8,59,10,59],[8,95,10,95],[8,88,10,88],[8,89,10,89],[8,90,10,90],[8,91,10,91],[8,84,10,84],[8,85,10,85],[8,86,10,86],[8,87,10,87],[8,80,10,80],[8,81,10,81],[8,82,10,82],[8,83,10,83],[8,76,10,76],[8,77,10,77],[8,78,10,78],[8,79,10,79],[8,117,10,122],[8,123,10,128],[8,129,10,134],[8,108,10,108],[8,109,10,109],[8,110,10,110],[8,111,10,116],[8,104,10,104],[8,105,10,105],[9,1,9,12],[9,13,9,24],[10,1,11,2],[10,3,11,4],[10,5,11,6],[10,7,11,12],[10,13,10,16],[10,17,11,18],[10,19,10,22],[10,23,11,24],[8,106,10,106],[8,107,10,107],[8,100,10,100],[8,101,10,101],[8,102,10,102],[8,103,10,103],[8,96,10,96],[8,97,10,97],[8,98,10,98],[8,99,10,99],[8,92,10,92],[8,93,10,93],[8,94,10,94],[12,23,12,24],[13,1,13,2],[13,3,13,4],[13,5,13,6],[13,7,13,12],[13,13,13,14],[13,15,13,16],[13,17,13,18],[13,19,13,20],[13,21,13,22],[11,21,11,22],[12,1,12,2],[12,3,12,4],[12,5,12,6],[12,7,12,12],[12,13,12,14],[12,15,12,16],[12,17,12,18],[12,19,12,20],[12,21,12,22],[14,23,14,24],[15,1,15,2],[15,3,15,4],[15,5,15,6],[15,7,15,12],[15,13,15,14],[15,15,15,16],[15,17,15,18],[15,19,15,20],[15,21,15,22],[13,23,13,24],[14,1,14,2],[14,3,14,4],[14,5,14,6],[14,7,14,12],[14,13,14,14],[14,15,14,16],[14,17,14,18],[14,19,14,20],[14,21,14,22],[16,23,16,24],[17,1,17,2],[17,3,17,4],[17,5,17,6],[17,7,17,12],[17,13,17,14],[17,15,17,16],[17,17,17,18],[17,19,17,20],[17,21,17,22],[15,23,15,24],[16,1,16,2],[16,3,16,4],[16,5,16,6],[16,7,16,12],[16,13,16,14],[16,15,16,16],[16,17,16,18],[16,19,16,20],[16,21,16,22],[18,23,18,24],[19,1,19,2],[19,3,19,4],[19,5,19,6],[19,7,19,12],[19,13,19,14],[19,15,19,16],[19,17,19,18],[19,19,19,20],[19,21,19,22],[17,23,17,24],[18,1,18,2],[18,3,18,4],[18,5,18,6],[18,7,18,12],[18,13,18,14],[18,15,18,16],[18,17,18,18],[18,19,18,20],[18,21,18,22],[20,23,20,24],[21,1,21,2],[21,3,21,4],[21,5,21,6],[21,7,21,12],[21,13,21,14],[21,15,21,16],[21,17,21,18],[21,19,21,20],[21,21,21,22],[19,23,19,24],[20,1,20,2],[20,3,20,4],[20,5,20,6],[20,7,20,12],[20,13,20,14],[20,15,20,16],[20,17,20,18],[20,19,20,20],[20,21,20,22],[22,23,22,24],[23,1,23,2],[23,3,23,4],[23,5,23,6],[23,7,23,12],[23,13,23,14],[23,15,23,16],[23,17,23,18],[23,19,23,20],[23,21,23,22],[21,23,21,24],[22,1,22,2],[22,3,22,4],[22,5,22,6],[22,7,22,12],[22,13,22,14],[22,15,22,16],[22,17,22,18],[22,19,22,20],[22,21,22,22],[24,23,24,24],[25,1,25,2],[25,3,25,4],[25,5,25,6],[25,7,25,12],[25,13,25,14],[25,15,25,16],[25,17,25,18],[25,19,25,20],[25,21,25,22],[23,23,23,24],[24,1,24,2],[24,3,24,4],[24,5,24,6],[24,7,24,12],[24,13,24,14],[24,15,24,16],[24,17,24,18],[24,19,24,20],[24,21,24,22],[26,23,26,24],[27,1,27,2],[27,3,27,4],[27,5,27,6],[27,7,27,12],[27,13,27,14],[27,15,27,16],[27,17,27,18],[27,19,27,20],[27,21,27,22],[25,23,25,24],[26,1,26,2],[26,3,26,4],[26,5,26,6],[26,7,26,12],[26,13,26,14],[26,15,26,16],[26,17,26,18],[26,19,26,20],[26,21,26,22],[28,23,28,24],[29,1,29,2],[29,3,29,4],[29,5,29,6],[29,7,29,12],[29,13,29,14],[29,15,29,16],[29,17,29,18],[29,19,29,20],[29,21,29,22],[27,23,27,24],[28,1,28,2],[28,3,28,4],[28,5,28,6],[28,7,28,12],[28,13,28,14],[28,15,28,16],[28,17,28,18],[28,19,28,20],[28,21,28,22],[30,23,30,24],[31,1,31,2],[31,3,31,4],[31,5,31,6],[31,7,31,12],[31,13,31,14],[31,15,31,16],[31,17,31,18],[31,19,31,20],[31,21,31,22],[29,23,29,24],[30,1,30,2],[30,3,30,4],[30,5,30,6],[30,7,30,12],[30,13,30,14],[30,15,30,16],[30,17,30,18],[30,19,30,20],[30,21,30,22],[32,23,32,24],[33,1,33,2],[33,3,33,4],[33,5,33,6],[33,7,33,12],[33,13,33,14],[33,15,33,16],[33,17,33,18],[33,19,33,20],[33,21,33,22],[31,23,31,24],[32,1,32,2],[32,3,32,4],[32,5,32,6],[32,7,32,12],[32,13,32,14],[32,15,32,16],[32,17,32,18],[32,19,32,20],[32,21,32,22],[34,23,34,24],[35,1,35,2],[35,3,35,4],[35,5,35,6],[35,7,35,12],[35,13,35,14],[35,15,35,16],[35,17,35,18],[35,19,35,20],[35,21,35,22],[33,23,33,24],[34,1,34,2],[34,3,34,4],[34,5,34,6],[34,7,34,12],[34,13,34,14],[34,15,34,16],[34,17,34,18],[34,19,34,20],[34,21,34,22],[36,23,36,24],[37,1,37,2],[37,3,37,4],[37,5,37,6],[37,7,37,12],[37,13,37,14],[37,15,37,16],[37,17,37,18],[37,19,37,20],[37,21,37,22],[35,23,35,24],[36,1,36,2],[36,3,36,4],[36,5,36,6],[36,7,36,12],[36,13,36,14],[36,15,36,16],[36,17,36,18],[36,19,36,20],[36,21,36,22],[38,23,38,24],[39,1,39,2],[39,3,39,4],[39,5,39,6],[39,7,39,12],[39,13,39,14],[39,15,39,16],[39,17,39,18],[39,19,39,20],[39,21,39,22],[37,23,37,24],[38,1,38,2],[38,3,38,4],[38,5,38,6],[38,7,38,12],[38,13,38,14],[38,15,38,16],[38,17,38,18],[38,19,38,20],[38,21,38,22],[40,23,40,24],[41,1,41,2],[41,3,41,4],[41,5,41,6],[41,7,41,12],[41,13,41,14],[41,15,41,16],[41,17,41,18],[41,19,41,20],[41,21,41,22],[39,23,39,24],[40,1,40,2],[40,3,40,4],[40,5,40,6],[40,7,40,12],[40,13,40,14],[40,15,40,16],[40,17,40,18],[40,19,40,20],[40,21,40,22],[42,23,42,24],[43,1,43,2],[43,3,43,4],[43,5,43,6],[43,7,43,12],[43,13,43,14],[43,15,43,16],[43,17,43,18],[43,19,43,20],[43,21,43,22],[41,23,41,24],[42,1,42,2],[42,3,42,4],[42,5,42,6],[42,7,42,12],[42,13,42,14],[42,15,42,16],[42,17,42,18],[42,19,42,20],[42,21,42,22],[44,23,44,24],[45,1,45,2],[45,3,45,4],[45,5,45,6],[45,7,45,12],[45,13,45,14],[45,15,45,16],[45,17,45,18],[45,19,45,20],[45,21,45,22],[43,23,43,24],[44,1,44,2],[44,3,44,4],[44,5,44,6],[44,7,44,12],[44,13,44,14],[44,15,44,16],[44,17,44,18],[44,19,44,20],[44,21,44,22],[46,23,46,24],[47,1,47,2],[47,3,47,4],[47,5,47,6],[47,7,47,12],[47,13,47,14],[47,15,47,16],[47,17,47,18],[47,19,47,20],[47,21,47,22],[45,23,45,24],[46,1,46,2],[46,3,46,4],[46,5,46,6],[46,7,46,12],[46,13,46,14],[46,15,46,16],[46,17,46,18],[46,19,46,20],[46,21,46,22],[48,23,48,24],[49,1,49,2],[49,3,49,4],[49,5,49,6],[49,7,49,12],[49,13,49,14],[49,15,49,16],[49,17,49,18],[49,19,49,20],[49,21,49,22],[47,23,47,24],[48,1,48,2],[48,3,48,4],[48,5,48,6],[48,7,48,12],[48,13,48,14],[48,15,48,16],[48,17,48,18],[48,19,48,20],[48,21,48,22],[50,23,50,24],[51,1,51,2],[51,3,51,4],[51,5,51,6],[51,7,51,12],[51,13,51,14],[51,15,51,16],[51,17,51,18],[51,19,51,20],[51,21,51,22],[49,23,49,24],[50,1,50,2],[50,3,50,4],[50,5,50,6],[50,7,50,12],[50,13,50,14],[50,15,50,16],[50,17,50,18],[50,19,50,20],[50,21,50,22],[52,23,52,24],[53,1,53,2],[53,3,53,4],[53,5,53,6],[53,7,53,12],[53,13,53,14],[53,15,53,16],[53,17,53,18],[53,19,53,20],[53,21,53,22],[51,23,51,24],[52,1,52,2],[52,3,52,4],[52,5,52,6],[52,7,52,12],[52,13,52,14],[52,15,52,16],[52,17,52,18],[52,19,52,20],[52,21,52,22],[54,23,54,24],[55,1,55,2],[55,3,55,4],[55,5,55,6],[55,7,55,12],[55,13,55,14],[55,15,55,16],[55,17,55,18],[55,19,55,20],[55,21,55,22],[53,23,53,24],[54,1,54,2],[54,3,54,4],[54,5,54,6],[54,7,54,12],[54,13,54,14],[54,15,54,16],[54,17,54,18],[54,19,54,20],[54,21,54,22],[56,23,56,24],[57,1,57,2],[57,3,57,4],[57,5,57,6],[57,7,57,12],[57,13,57,14],[57,15,57,16],[57,17,57,18],[57,19,57,20],[57,21,57,22],[55,23,55,24],[56,1,56,2],[56,3,56,4],[56,5,56,6],[56,7,56,12],[56,13,56,14],[56,15,56,16],[56,17,56,18],[56,19,56,20],[56,21,56,22],[58,23,58,24],[59,1,59,2],[59,3,59,4],[59,5,59,6],[59,7,59,12],[59,13,59,14],[59,15,59,16],[59,17,59,18],[59,19,59,20],[59,21,59,22],[57,23,57,24],[58,1,58,2],[58,3,58,4],[58,5,58,6],[58,7,58,12],[58,13,58,14],[58,15,58,16],[58,17,58,18],[58,19,58,20],[58,21,58,22],[60,23,60,24],[61,1,61,2],[61,3,61,4],[61,5,61,6],[61,7,61,12],[61,13,61,14],[61,15,61,16],[61,17,61,18],[61,19,61,20],[61,21,61,22],[59,23,59,24],[60,1,60,2],[60,3,60,4],[60,5,60,6],[60,7,60,12],[60,13,60,14],[60,15,60,16],[60,17,60,18],[60,19,60,20],[60,21,60,22],[62,23,62,24],[63,1,63,2],[63,3,63,4],[63,5,63,6],[63,7,63,12],[63,13,63,14],[63,15,63,16],[63,17,63,18],[63,19,63,20],[63,21,63,22],[61,23,61,24],[62,1,62,2],[62,3,62,4],[62,5,62,6],[62,7,62,12],[62,13,62,14],[62,15,62,16],[62,17,62,18],[62,19,62,20],[62,21,62,22],[64,23,64,24],[65,1,65,2],[65,3,65,4],[65,5,65,6],[65,7,65,12],[65,13,65,14],[65,15,65,16],[65,17,65,18],[65,19,65,20],[65,21,65,22],[63,23,63,24],[64,1,64,2],[64,3,64,4],[64,5,64,6],[64,7,64,12],[64,13,64,14],[64,15,64,16],[64,17,64,18],[64,19,64,20],[64,21,64,22],[66,23,66,24],[67,1,67,2],[67,3,67,4],[67,5,67,6],[67,7,67,12],[67,13,67,14],[67,15,67,16],[67,17,67,18],[67,19,67,20],[67,21,67,22],[65,23,65,24],[66,1,66,2],[66,3,66,4],[66,5,66,6],[66,7,66,12],[66,13,66,14],[66,15,66,16],[66,17,66,18],[66,19,66,20],[66,21,66,22],[68,23,68,24],[69,1,69,2],[69,3,69,4],[69,5,69,6],[69,7,69,12],[69,13,69,14],[69,15,69,16],[69,17,69,18],[69,19,69,20],[69,21,69,22],[67,23,67,24],[68,1,68,2],[68,3,68,4],[68,5,68,6],[68,7,68,12],[68,13,68,14],[68,15,68,16],[68,17,68,18],[68,19,68,20],[68,21,68,22],[70,23,70,24],[71,1,71,2],[71,3,71,4],[71,5,71,6],[71,7,71,12],[71,13,71,14],[71,15,71,16],[71,17,71,18],[71,19,71,20],[71,21,71,22],[69,23,69,24],[70,1,70,2],[70,3,70,4],[70,5,70,6],[70,7,70,12],[70,13,70,14],[70,15,70,16],[70,17,70,18],[70,19,70,20],[70,21,70,22],[72,23,72,24],[73,1,73,2],[73,3,73,4],[73,5,73,6],[73,7,73,12],[73,13,73,14],[73,15,73,16],[73,17,73,18],[73,19,73,20],[73,21,73,22],[71,23,71,24],[72,1,72,2],[72,3,72,4],[72,5,72,6],[72,7,72,12],[72,13,72,14],[72,15,72,16],[72,17,72,18],[72,19,72,20],[72,21,72,22],[74,23,74,24],[75,1,75,2],[75,3,75,4],[75,5,75,6],[75,7,75,12],[75,13,75,14],[75,15,75,16],[75,17,75,18],[75,19,75,20],[75,21,75,22],[73,23,73,24],[74,1,74,2],[74,3,74,4],[74,5,74,6],[74,7,74,12],[74,13,74,14],[74,15,74,16],[74,17,74,18],[74,19,74,20],[74,21,74,22],[76,23,76,24],[77,1,77,2],[77,3,77,4],[77,5,77,6],[77,7,77,12],[77,13,77,14],[77,15,77,16],[77,17,77,18],[77,19,77,20],[77,21,77,22],[75,23,75,24],[76,1,76,2],[76,3,76,4],[76,5,76,6],[76,7,76,12],[76,13,76,14],[76,15,76,16],[76,17,76,18],[76,19,76,20],[76,21,76,22],[78,23,78,24],[79,1,79,2],[79,3,79,4],[79,5,79,6],[79,7,79,12],[79,13,79,14],[79,15,79,16],[79,17,79,18],[79,19,79,20],[79,21,79,22],[77,23,77,24],[78,1,78,2],[78,3,78,4],[78,5,78,6],[78,7,78,12],[78,13,78,14],[78,15,78,16]],"merged_total":1784,"flags":["merged_cut"]}
["GHS",".",null,null,null,null,null,null,null,null,null,null,null,"Fachhändler:",null,null,null,null,null,null,null,null,null,null,null,"Anzahl",null,null,null,null,null,null,null,null,null,null,null,null,null,null,null,null,null,null,null,null,null,null,null,null,null,null,1,2,3,4,5,6,7,8,9,10,11,12,13,14,15,16,17,18,19,20,21,22,23,24,25,26,27,28,29,30,31,32,33,34,35,36,37,38,39,40,41,42,43,44,45,46,47,48,49,50,51,52,53,54,55,56,57,58,59,60,61,62,63,64,65,66,67,68,69,70,71,72,73,74,75,76,77,78,79,80,81,82,83]
["HS","."]
["HS/Z",".","Anlagenart:",null,null,"GHS",null,null,null,null,null,null,null,null,null,null,null,null,null,null,null,null,null,null,null,"Übergeordnete Schlüssel"]
["Z/HS",".","System:",null,null,"TH6"]
["Z ",".","Kunde:",null,null,"Max Mustermann",null,null,null,null,null,null,null,"Feld für Hinweise:"]
["SP",".",null,null,null,"Musterstr. 1"]
["STR",".",null,null,null,"55555 Musterdorf"]
["HSR",".","Kom.:",null,null,"Muster "]
["Standard",".","Datum:",null,null,"2006-03-30",null,null,null,null,null,null,null,null,null,null,null,null,null,null,null,null,null,null,null,null,{"$f":"IF(VLOOKUP($F$3,$BA$13:$IV$18,11,FALSE)<=0,\"\",VLOOKUP($F$3,$BA$13:$IV$18,11,FALSE))","v":"GHS"},{"$f":"IF(VLOOKUP($F$3,$BA$13:$IV$18,12,FALSE)<=0,\"\",VLOOKUP($F$3,$BA$13:$IV$18,12,FALSE))","v":"GS 1"},{"$f":"IF(VLOOKUP($F$3,$BA$13:$IV$18,13,FALSE)<=0,\"\",VLOOKUP($F$3,$BA$13:$IV$18,13,FALSE))","v":"GS 2"},{"$f":"IF(VLOOKUP($F$3,$BA$13:$IV$18,14,FALSE)<=0,\"\",VLOOKUP($F$3,$BA$13:$IV$18,14,FALSE))","v":"GS 3"},null,null,null,null,null,null,null,null,null,null,null,null,null,null,null,null,null,null,null,null,null,null,null,null,null,null,null,null,null,null,null,null,null,null,null,null,null,null,null,null,null,null,null,null,null,null,null,null,null,null,null,null,null,null,null,null,null,null,null,null,null,null,null,null,null,null,null,null,null,null,null,null,null,null,null,null,null,null,null,null,null,"Spalte 1",null,null,null,null,null,"Spalte 2",null,null,null,null,null,"Spalte 3",null,null,null,null,null,"Spalte 4"]
["WZ","WILKA - VORSPRUNG DURCH QUALITÄT",null,null,null,null,null,null,null,null,null,null,null,".",null,null,null,null,null,null,null,null,null,null,null,null,{"$f":"IF(VLOOKUP($F$3,$BA$13:$IV$18,58,FALSE)<=0,\"\",VLOOKUP($F$3,$BA$13:$IV$18,58,FALSE))","v":"Mmv"},"Mmv","Mmv","Mmv"]
[null,"Position",null,"Schließungs- nummer",null,"Türnummer",null,"Raumbezeichnung",null,null,null,null,null,"Stückzahl",null,null,null,"Artikel",null,"Längen",null,null,null,"Färbung ",null,null,"Mmv","Mmv","Mmv","Mmv"]
[null,null,null,null,null,null,null,null,null,null,null,null,null,"Zylinder",null,"Schlüssel",null,null,null,"A  Aussen",null,"B   Innen",null,null,null,"ZAS",null,null,null,null,null,null,null,null,null,null,null,null,null,null,null,null,null,null,null,null,null,null,null,null,null,null,"Art","Schlg. 1","Bez. 1","Stückz. 1","Schlüssel 1","Artikel 1","Lg A1","Lg B1","Färb. 1","ZAS 1","Übg 1","Übg 2","Übg 3","Übg 4","Schlg. 2","Bez. 2","Stückz. 2","Schlüssel 2","Artikel 2","Lg A2","Lg B2","Färb. 2","ZAS 2","Schlg. 3","Bez. 3","Stückz. 3","Schlüssel 3","Artikel 3","Lg A3","Lg B3","Färb. 3","ZAS 3","Schlg. 4","Bez. 4","Stückz. 4","Schlüssel 4","Artikel 4","Lg A4","Lg B4","Färb. 4","ZAS 4","Schlg. 5","Bez. 5","Stückz. 5","Schlüssel 5","Artikel 5","Lg A5","Lg B5","Färb. 5","ZAS 5","Schlg. 6","Bez. 6","Stückz. 6","Schlüssel 6","Artikel 6","Lg A6","Lg B6","Färb. 6","ZAS 6","Fkt. 1","Fkt. 2","Fkt. 3","Fkt. 4","Fkt. 5","Fkt. 6","Fkt. 7","Fkt. 8","Fkt. 9","Fkt.10","Fkt.11","Fkt.12","Fkt.13","Fkt.14","Fkt.15","Fkt.16","Fkt.17","Fkt.18","Fkt.19","Fkt.20","Fkt.21","Fkt.22","Fkt.23","Fkt.24"]
[null,null,null,{"$f":"IF(VLOOKUP($F$3,$BA$13:$IV$18,2,FALSE)<=0,\"\",VLOOKUP($F$3,$BA$13:$IV$18,2,FALSE))","v":1},null,null,null,{"$f":"IF(VLOOKUP($F$3,$BA$13:$IV$18,3,FALSE)<=0,\"\",VLOOKUP($F$3,$BA$13:$IV$18,3,FALSE))","v":"Verwaltung"},null,{"$f":"IF(VLOOKUP($F$3,$BA$13:$IV$18,2,FALSE)<=0,\"\",VLOOKUP($F$3,$BA$13:$IV$18,2,FALSE))","v":1},null,{"$f":"IF(VLOOKUP($F$3,$BA$13:$IV$18,2,FALSE)<=0,\"\",VLOOKUP($F$3,$BA$13:$IV$18,2,FALSE))","v":1},null,{"$f":"IF(VLOOKUP($F$3,$BA$13:$IV$18,4,FALSE)<=0,\"\",VLOOKUP($F$3,$BA$13:$IV$18,4,FALSE))","v":2},null,{"$f":"IF(VLOOKUP($F$3,$BA$13:$IV$18,5,FALSE)<=0,\"\",VLOOKUP($F$3,$BA$13:$IV$18,5,FALSE))","v":6},null,{"$f":"IF(VLOOKUP($F$3,$BA$13:$IV$18,6,FALSE)<=0,\"\",VLOOKUP($F$3,$BA$13:$IV$18,6,FALSE))","v":1400},null,{"$f":"IF(VLOOKUP($F$3,$BA$13:$IV$18,7,FALSE)<=0,\"\",VLOOKUP($F$3,$BA$13:$IV$18,7,FALSE))","v":30},null,{"$f":"IF(VLOOKUP($F$3,$BA$13:$IV$18,8,FALSE)<=0,\"\",VLOOKUP($F$3,$BA$13:$IV$18,8,FALSE))","v":40},null,{"$f":"IF(VLOOKUP($F$3,$BA$13:$IV$18,9,FALSE)<=0,\"\",VLOOKUP($F$3,$BA$13:$IV$18,9,FALSE))","v":"Mmv"},null,{"$f":"IF(VLOOKUP($F$3,$BA$13:$IV$18,10,FALSE)<=0,\"\",VLOOKUP($F$3,$BA$13:$IV$18,10,FALSE))","v":""},{"$f":"IF(VLOOKUP($F$3,$BA$13:$IV$18,60,FALSE)<=0,\"\",VLOOKUP($F$3,$BA$13:$IV$18,60,FALSE))","v":"X"},{"$f":"IF(VLOOKUP($F$3,$BA$13:$IV$18,66,FALSE)<=0,\"\",VLOOKUP($F$3,$BA$13:$IV$18,66,FALSE))","v":"X"},{"$f":"IF(VLOOKUP($F$3,$BA$13:$IV$18,72,FALSE)<=0,\"\",VLOOKUP($F$3,$BA$13:$IV$18,72,FALSE))","v":""},{"$f":"IF(VLOOKUP($F$3,$BA$13:$IV$18,78,FALSE)<=0,\"\",VLOOKUP($F$3,$BA$13:$IV$18,78,FALSE))","v":"X"},null,null,null,null,null,null,null,null,null,null,null,null,null,null,null,null,null,null,null,null,null,null,"GHS",1,"Verwaltung",2,6,1400,30,40,"Mmv",null,"GHS","GS 1","GS 2","GS 3",2,"Buchhaltung",1,3,1400,40,40,"Mmv",null,3,"Produktion",1,3,1405,30,30,"Mmv",null,4,"Versand",1,3,1400,30,30,"Mmv",null,5,"Verkauf",1,3,1400,30,30,"Mpol",null,6,"Einkauf",1,3,1405,30,40,"Mmv",5,"X","X","X","X","X","X","X","X",null,null,"X","X",null,null,"X","X",null,null,"X",null,null,null,"X","X"]
[null,null,null,{"$f":"IF(VLOOKUP($F$3,$BA$13:$IV$18,15,FALSE)<=0,\"\",VLOOKUP($F$3,$BA$13:$IV$18,15,FALSE))","v":2},null,null,null,{"$f":"IF(VLOOKUP($F$3,$BA$13:$IV$18,16,FALSE)<=0,\"\",VLOOKUP($F$3,$BA$13:$IV$18,16,FALSE))","v":"Buchhaltung"},null,1,null,1,null,{"$f":"IF(VLOOKUP($F$3,$BA$13:$IV$18,17,FALSE)<=0,\"\",VLOOKUP($F$3,$BA$13:$IV$18,17,FALSE))","v":1},null,{"$f":"IF(VLOOKUP($F$3,$BA$13:$IV$18,18,FALSE)<=0,\"\",VLOOKUP($F$3,$BA$13:$IV$18,18,FALSE))","v":3},null,{"$f":"IF(VLOOKUP($F$3,$BA$13:$IV$18,19,FALSE)<=0,\"\",VLOOKUP($F$3,$BA$13:$IV$18,19,FALSE))","v":1400},null,{"$f":"IF(VLOOKUP($F$3,$BA$13:$IV$18,20,FALSE)<=0,\"\",VLOOKUP($F$3,$BA$13:$IV$18,20,FALSE))","v":40},null,{"$f":"IF(VLOOKUP($F$3,$BA$13:$IV$18,21,FALSE)<=0,\"\",VLOOKUP($F$3,$BA$13:$IV$18,21,FALSE))","v":40},null,{"$f":"IF(VLOOKUP($F$3,$BA$13:$IV$18,22,FALSE)<=0,\"\",VLOOKUP($F$3,$BA$13:$IV$18,22,FALSE))","v":"Mmv"},null,{"$f":"IF(VLOOKUP($F$3,$BA$13:$IV$18,23,FALSE)<=0,\"\",VLOOKUP($F$3,$BA$13:$IV$18,23,FALSE))","v":""},{"$f":"IF(VLOOKUP($F$3,$BA$13:$IV$18,61,FALSE)<=0,\"\",VLOOKUP($F$3,$BA$13:$IV$18,61,FALSE))","v":"X"},{"$f":"IF(VLOOKUP($F$3,$BA$13:$IV$18,67,FALSE)<=0,\"\",VLOOKUP($F$3,$BA$13:$IV$18,67,FALSE))","v":"X"},{"$f":"IF(VLOOKUP($F$3,$BA$13:$IV$18,73,FALSE)<=0,\"\",VLOOKUP($F$3,$BA$13:$IV$18,73,FALSE))","v":""},{"$f":"IF(VLOOKUP($F$3,$BA$13:$IV$18,79,FALSE)<=0,\"\",VLOOKUP($F$3,$BA$13:$IV$18,79,FALSE))","v":""},null,null,null,null,null,null,null,null,null,null,null,null,null,null,null,null,null,null,null,null,null,null,"HS",1,"Verwaltung",1,3,1463,30,45,"Mmv",null,"HS",null,null,null,2,"Buchhaltung",1,3,1463,30,40,"Mmv",null,3,"Produktion",1,3,1400,30,40,"Mmv",null,4,"Versand",1,3,1400,30,40,"Mmv",null,5,"Verkauf",1,3,1463,30,40,"Mpol",null,null,null,null,null,null,null,null,null,null,"X","X","X","X","X"]
[null,null,null,{"$f":"IF(VLOOKUP($F$3,$BA$13:$IV$18,24,FALSE)<=0,\"\",VLOOKUP($F$3,$BA$13:$IV$18,24,FALSE))","v":3},null,null,null,{"$f":"IF(VLOOKUP($F$3,$BA$13:$IV$18,25,FALSE)<=0,\"\",VLOOKUP($F$3,$BA$13:$IV$18,25,FALSE))","v":"Produktion"},null,1,null,1,null,{"$f":"IF(VLOOKUP($F$3,$BA$13:$IV$18,26,FALSE)<=0,\"\",VLOOKUP($F$3,$BA$13:$IV$18,26,FALSE))","v":1},null,{"$f":"IF(VLOOKUP($F$3,$BA$13:$IV$18,27,FALSE)<=0,\"\",VLOOKUP($F$3,$BA$13:$IV$18,27,FALSE))","v":3},null,{"$f":"IF(VLOOKUP($F$3,$BA$13:$IV$18,28,FALSE)<=0,\"\",VLOOKUP($F$3,$BA$13:$IV$18,28,FALSE))","v":1405},null,{"$f":"IF(VLOOKUP($F$3,$BA$13:$IV$18,29,FALSE)<=0,\"\",VLOOKUP($F$3,$BA$13:$IV$18,29,FALSE))","v":30},null,{"$f":"IF(VLOOKUP($F$3,$BA$13:$IV$18,30,FALSE)<=0,\"\",VLOOKUP($F$3,$BA$13:$IV$18,30,FALSE))","v":30},null,{"$f":"IF(VLOOKUP($F$3,$BA$13:$IV$18,31,FALSE)<=0,\"\",VLOOKUP($F$3,$BA$13:$IV$18,31,FALSE))","v":"Mmv"},null,{"$f":"IF(VLOOKUP($F$3,$BA$13:$IV$18,32,FALSE)<=0,\"\",VLOOKUP($F$3,$BA$13:$IV$18,32,FALSE))","v":""},{"$f":"IF(VLOOKUP($F$3,$BA$13:$IV$18,62,FALSE)<=0,\"\",VLOOKUP($F$3,$BA$13:$IV$18,62,FALSE))","v":"X"},{"$f":"IF(VLOOKUP($F$3,$BA$13:$IV$18,68,FALSE)<=0,\"\",VLOOKUP($F$3,$BA$13:$IV$18,68,FALSE))","v":""},{"$f":"IF(VLOOKUP($F$3,$BA$13:$IV$18,74,FALSE)<=0,\"\",VLOOKUP($F$3,$BA$13:$IV$18,74,FALSE))","v":"X"},{"$f":"IF(VLOOKUP($F$3,$BA$13:$IV$18,80,FALSE)<=0,\"\",VLOOKUP($F$3,$BA$13:$IV$18,80,FALSE))","v":""},null,null,null,null,null,null,null,null,null,null,null,null,null,null,null,null,null,null,null,null,null,null,"HS/Z","Z","Haustür",1,3,1463,30,50,"Mmv",null,"HS",null,"Z",null,1,"Wohnung 1",1,3,1463,40,50,"Mmv",null,2,"Wohnung 2",1,3,1463,40,50,"Mmv",null,3,"Heizungsraum",1,null,1400,30,50,"Mmv",null,"Z","Kellertür",1,3,1400,30,50,"Mmv",null,null,null,null,null,null,null,null,null,null,"X","X","X","X","X",null,null,null,null,null,null,null,"Z","I","I","I","Z"]
[null,null,null,{"$f":"IF(VLOOKUP($F$3,$BA$13:$IV$18,33,FALSE)<=0,\"\",VLOOKUP($F$3,$BA$13:$IV$18,33,FALSE))","v":4},null,null,null,{"$f":"IF(VLOOKUP($F$3,$BA$13:$IV$18,34,FALSE)<=0,\"\",VLOOKUP($F$3,$BA$13:$IV$18,34,FALSE))","v":"Versand"},null,1,null,1,null,{"$f":"IF(VLOOKUP($F$3,$BA$13:$IV$18,35,FALSE)<=0,\"\",VLOOKUP($F$3,$BA$13:$IV$18,35,FALSE))","v":1},null,{"$f":"IF(VLOOKUP($F$3,$BA$13:$IV$18,36,FALSE)<=0,\"\",VLOOKUP($F$3,$BA$13:$IV$18,36,FALSE))","v":3},null,{"$f":"IF(VLOOKUP($F$3,$BA$13:$IV$18,37,FALSE)<=0,\"\",VLOOKUP($F$3,$BA$13:$IV$18,37,FALSE))","v":1400},null,{"$f":"IF(VLOOKUP($F$3,$BA$13:$IV$18,38,FALSE)<=0,\"\",VLOOKUP($F$3,$BA$13:$IV$18,38,FALSE))","v":30},null,{"$f":"IF(VLOOKUP($F$3,$BA$13:$IV$18,39,FALSE)<=0,\"\",VLOOKUP($F$3,$BA$13:$IV$18,39,FALSE))","v":30},null,{"$f":"IF(VLOOKUP($F$3,$BA$13:$IV$18,40,FALSE)<=0,\"\",VLOOKUP($F$3,$BA$13:$IV$18,40,FALSE))","v":"Mmv"},null,{"$f":"IF(VLOOKUP($F$3,$BA$13:$IV$18,41,FALSE)<=0,\"\",VLOOKUP($F$3,$BA$13:$IV$18,41,FALSE))","v":""},{"$f":"IF(VLOOKUP($F$3,$BA$13:$IV$18,63,FALSE)<=0,\"\",VLOOKUP($F$3,$BA$13:$IV$18,63,FALSE))","v":"X"},{"$f":"IF(VLOOKUP($F$3,$BA$13:$IV$18,69,FALSE)<=0,\"\",VLOOKUP($F$3,$BA$13:$IV$18,69,FALSE))","v":""},{"$f":"IF(VLOOKUP($F$3,$BA$13:$IV$18,75,FALSE)<=0,\"\",VLOOKUP($F$3,$BA$13:$IV$18,75,FALSE))","v":"X"},{"$f":"IF(VLOOKUP($F$3,$BA$13:$IV$18,81,FALSE)<=0,\"\",VLOOKUP($F$3,$BA$13:$IV$18,81,FALSE))","v":""},null,null,null,null,null,null,null,null,null,null,null,null,null,null,null,null,null,null,null,null,null,null,"Z/HS","Z","Haustür",1,3,1405,50,30,"Mmv",4,"HS T",null,"Z",null,1,"Wohnung 1",1,3,1463,40,40,"Mmv",null,2,"Wohnung 2",1,3,1463,30,50,"Mmv",null,3,"Heizungsraum",1,null,1400,30,40,"Mmv",null,"Z","Kellertür",1,3,1400,30,30,"Mmv",null,null,null,null,null,null,null,null,null,null,"X",null,null,"X","X",null,null,null,null,null,null,null,"Z","I","I","I","Z"]
[null,null,null,{"$f":"IF(VLOOKUP($F$3,$BA$13:$IV$18,42,FALSE)<=0,\"\",VLOOKUP($F$3,$BA$13:$IV$18,42,FALSE))","v":5},null,null,null,{"$f":"IF(VLOOKUP($F$3,$BA$13:$IV$18,43,FALSE)<=0,\"\",VLOOKUP($F$3,$BA$13:$IV$18,43,FALSE))","v":"Verkauf"},null,1,null,1,null,{"$f":"IF(VLOOKUP($F$3,$BA$13:$IV$18,44,FALSE)<=0,\"\",VLOOKUP($F$3,$BA$13:$IV$18,44,FALSE))","v":1},null,{"$f":"IF(VLOOKUP($F$3,$BA$13:$IV$18,45,FALSE)<=0,\"\",VLOOKUP($F$3,$BA$13:$IV$18,45,FALSE))","v":3},null,{"$f":"IF(VLOOKUP($F$3,$BA$13:$IV$18,46,FALSE)<=0,\"\",VLOOKUP($F$3,$BA$13:$IV$18,46,FALSE))","v":1400},null,{"$f":"IF(VLOOKUP($F$3,$BA$13:$IV$18,47,FALSE)<=0,\"\",VLOOKUP($F$3,$BA$13:$IV$18,47,FALSE))","v":30},null,{"$f":"IF(VLOOKUP($F$3,$BA$13:$IV$18,48,FALSE)<=0,\"\",VLOOKUP($F$3,$BA$13:$IV$18,48,FALSE))","v":30},null,{"$f":"IF(VLOOKUP($F$3,$BA$13:$IV$18,49,FALSE)<=0,\"\",VLOOKUP($F$3,$BA$13:$IV$18,49,FALSE))","v":"Mpol"},null,{"$f":"IF(VLOOKUP($F$3,$BA$13:$IV$18,50,FALSE)<=0,\"\",VLOOKUP($F$3,$BA$13:$IV$18,50,FALSE))","v":""},{"$f":"IF(VLOOKUP($F$3,$BA$13:$IV$18,64,FALSE)<=0,\"\",VLOOKUP($F$3,$BA$13:$IV$18,64,FALSE))","v":"X"},{"$f":"IF(VLOOKUP($F$3,$BA$13:$IV$18,70,FALSE)<=0,\"\",VLOOKUP($F$3,$BA$13:$IV$18,70,FALSE))","v":"X"},{"$f":"IF(VLOOKUP($F$3,$BA$13:$IV$18,76,FALSE)<=0,\"\",VLOOKUP($F$3,$BA$13:$IV$18,76,FALSE))","v":""},{"$f":"IF(VLOOKUP($F$3,$BA$13:$IV$18,82,FALSE)<=0,\"\",VLOOKUP($F$3,$BA$13:$IV$18,82,FALSE))","v":"X"},null,null,null,null,null,null,null,null,null,null,null,null,null,null,null,null,null,null,null,null,null,null,"Z ","Z","Haustür",1,3,1400,40,40,"Mmv",null,"Z",null,3,null,1,"Wohnung 1",1,3,1463,30,50,"Mmv",null,2,"Wohnung 2",1,3,1463,40,40,"Mmv",null,3,"Heizungsraum",1,3,1400,30,30,"Mmv",null,"Z","Kellertür",2,null,1400,30,40,"Mmv",null,null,null,null,null,null,null,null,null,null,"Z","I","I","I","Z",null,null,null,null,null,null,null,null,"I",null,"M"]
[null,null,null,{"$f":"IF(VLOOKUP($F$3,$BA$13:$IV$18,51,FALSE)<=0,\"\",VLOOKUP($F$3,$BA$13:$IV$18,51,FALSE))","v":6},null,null,null,{"$f":"IF(VLOOKUP($F$3,$BA$13:$IV$18,52,FALSE)<=0,\"\",VLOOKUP($F$3,$BA$13:$IV$18,52,FALSE))","v":"Einkauf"},null,1,null,1,null,{"$f":"IF(VLOOKUP($F$3,$BA$13:$IV$18,53,FALSE)<=0,\"\",VLOOKUP($F$3,$BA$13:$IV$18,53,FALSE))","v":1},null,{"$f":"IF(VLOOKUP($F$3,$BA$13:$IV$18,54,FALSE)<=0,\"\",VLOOKUP($F$3,$BA$13:$IV$18,54,FALSE))","v":3},null,{"$f":"IF(VLOOKUP($F$3,$BA$13:$IV$18,55,FALSE)<=0,\"\",VLOOKUP($F$3,$BA$13:$IV$18,55,FALSE))","v":1405},null,{"$f":"IF(VLOOKUP($F$3,$BA$13:$IV$18,56,FALSE)<=0,\"\",VLOOKUP($F$3,$BA$13:$IV$18,56,FALSE))","v":30},null,{"$f":"IF(VLOOKUP($F$3,$BA$13:$IV$18,57,FALSE)<=0,\"\",VLOOKUP($F$3,$BA$13:$IV$18,57,FALSE))","v":40},null,{"$f":"IF(VLOOKUP($F$3,$BA$13:$IV$18,58,FALSE)<=0,\"\",VLOOKUP($F$3,$BA$13:$IV$18,58,FALSE))","v":"Mmv"},null,{"$f":"IF(VLOOKUP($F$3,$BA$13:$IV$18,59,FALSE)<=0,\"\",VLOOKUP($F$3,$BA$13:$IV$18,59,FALSE))","v":5},{"$f":"IF(VLOOKUP($F$3,$BA$13:$IV$18,65,FALSE)<=0,\"\",VLOOKUP($F$3,$BA$13:$IV$18,65,FALSE))","v":"X"},{"$f":"IF(VLOOKUP($F$3,$BA$13:$IV$18,71,FALSE)<=0,\"\",VLOOKUP($F$3,$BA$13:$IV$18,71,FALSE))","v":"X"},{"$f":"IF(VLOOKUP($F$3,$BA$13:$IV$18,77,FALSE)<=0,\"\",VLOOKUP($F$3,$BA$13:$IV$18,77,FALSE))","v":""},{"$f":"IF(VLOOKUP($F$3,$BA$13:$IV$18,83,FALSE)<=0,\"\",VLOOKUP($F$3,$BA$13:$IV$18,83,FALSE))","v":"X"},null,null,null,null,null,null,null,null,null,null,null,null,null,null,null,null,null,null,null,null,null,null,"SP",1,"Haustür",1,3,1400,30,30,"Mmv",null,null,null,null,null,1,"Wohnung  ",1,3,1463,30,30,"Mmv",null,1,"Garage",1,null,1410,null,30,"Mmv"]

{"sheet":"Schließplan","index":2,"n_rows":3129,"n_cols":13,"rows_kept":3129,"cut":false,"hidden":false,"merged":[[4,19,9,19],[12,9,12,10],[12,4,13,4],[6,3,6,4],[11,1,11,4],[9,3,9,4],[8,3,8,4],[7,3,7,4],[12,3,13,3],[12,2,13,2],[12,1,13,1],[12,5,12,6],[12,7,13,7],[12,11,13,11],[4,13,9,13],[4,14,9,14],[10,12,12,12],[4,12,9,12],[10,15,12,15],[10,16,12,16],[10,17,12,17],[10,18,12,18],[10,13,12,13],[10,14,12,14],[1,21,3,21],[1,22,3,22],[1,23,3,23],[1,24,3,24],[1,16,3,16],[1,17,3,17],[1,18,3,18],[1,20,3,20],[1,12,3,12],[1,13,3,13],[1,14,3,14],[1,15,3,15],[1,33,3,33],[1,34,3,34],[1,35,3,35],[1,36,3,36],[1,29,3,29],[1,30,3,30],[1,31,3,31],[1,32,3,32],[1,25,3,25],[1,26,3,26],[1,27,3,27],[1,28,3,28],[1,45,3,45],[1,46,3,46],[1,47,3,47],[1,48,3,48],[1,41,3,41],[1,42,3,42],[1,43,3,43],[1,44,3,44],[1,37,3,37],[1,38,3,38],[1,39,3,39],[1,40,3,40],[1,57,3,57],[1,58,3,58],[1,59,3,59],[1,60,3,60],[1,53,3,53],[1,54,3,54],[1,55,3,55],[1,56,3,56],[1,49,3,49],[1,50,3,50],[1,51,3,51],[1,52,3,52],[1,69,3,69],[1,70,3,70],[1,71,3,71],[1,72,3,72],[1,65,3,65],[1,66,3,66],[1,67,3,67],[1,68,3,68],[1,61,3,61],[1,62,3,62],[1,63,3,63],[1,64,3,64],[1,81,3,81],[1,82,3,82],[1,83,3,83],[1,84,3,84],[1,77,3,77],[1,78,3,78],[1,79,3,79],[1,80,3,80],[1,73,3,73],[1,74,3,74],[1,75,3,75],[1,76,3,76],[1,94,3,94],[1,95,3,95],[1,96,3,96],[1,89,3,89],[1,90,3,90],[1,91,3,91],[1,92,3,92],[1,85,3,85],[1,86,3,86],[1,87,3,87],[1,88,3,88],[1,113,3,113],[1,111,3,111],[1,112,3,112],[1,103,3,103],[1,104,3,104],[1,97,3,97],[1,98,3,98],[4,15,9,15],[4,16,9,16],[4,17,9,17],[4,18,9,18],[4,20,9,20],[4,21,9,21],[1,109,3,109],[1,110,3,110],[1,105,3,105],[1,106,3,106],[1,107,3,107],[1,108,3,108],[1,101,3,101],[1,102,3,102],[1,99,3,99],[1,100,3,100],[1,93,3,93],[4,30,9,30],[4,31,9,31],[4,32,9,32],[4,33,9,33],[4,26,9,26],[4,27,9,27],[4,28,9,28],[4,29,9,29],[4,23,9,23],[4,24,9,24],[4,25,9,25],[4,42,9,42],[4,43,9,43],[4,44,9,44],[4,45,9,45],[4,38,9,38],[4,39,9,39],[4,40,9,40],[4,41,9,41],[4,34,9,34],[4,35,9,35],[4,36,9,36],[4,37,9,37],[4,54,9,54],[4,55,9,55],[4,56,9,56],[4,57,9,57],[4,50,9,50],[4,51,9,51],[4,52,9,52],[4,53,9,53],[4,46,9,46],[4,47,9,47],[4,48,9,48],[4,49,9,49],[4,66,9,66],[4,67,9,67],[4,68,9,68],[4,69,9,69],[4,62,9,62],[4,63,9,63],[4,64,9,64],[4,65,9,65],[4,58,9,58],[4,59,9,59],[4,60,9,60],[4,61,9,61],[4,78,9,78],[4,79,9,79],[4,80,9,80],[4,81,9,81],[4,74,9,74],[4,75,9,75],[4,76,9,76],[4,77,9,77],[4,70,9,70],[4,71,9,71],[4,72,9,72],[4,73,9,73],[4,113,9,113],[4,109,9,109],[4,111,9,111],[4,112,9,112],[4,97,9,97],[4,107,9,107],[4,102,9,102],[4,103,9,103],[4,104,9,104],[4,106,9,106],[4,98,9,98],[4,99,9,99],[4,100,9,100],[4,110,9,110],[4,108,9,108],[4,89,9,89],[4,101,9,101],[4,105,9,105],[4,94,9,94],[4,95,9,95],[4,96,9,96],[4,93,9,93],[4,90,9,90],[4,91,9,91],[4,92,9,92],[4,82,9,82],[4,83,9,83],[4,84,9,84],[4,85,9,85],[4,86,9,86],[4,87,9,87],[4,88,9,88],[10,20,12,20],[10,21,12,21],[10,22,12,22],[10,23,12,23],[10,44,12,44],[10,45,12,45],[10,46,12,46],[10,47,12,47],[10,40,12,40],[10,41,12,41],[10,42,12,42],[10,43,12,43],[10,36,12,36],[10,37,12,37],[10,38,12,38],[10,39,12,39],[10,56,12,56],[10,19,12,19],[10,32,12,32],[10,33,12,33],[10,34,12,34],[10,35,12,35],[10,28,12,28],[10,29,12,29],[10,30,12,30],[10,31,12,31],[10,24,12,24],[10,25,12,25],[10,26,12,26],[10,27,12,27],[10,57,12,57],[10,58,12,58],[10,59,12,59],[10,52,12,52],[10,53,12,53],[10,54,12,54],[10,55,12,55],[10,48,12,48],[10,49,12,49],[10,50,12,50],[10,51,12,51],[10,70,12,70],[10,71,12,71],[10,64,12,64],[10,65,12,65],[10,66,12,66],[10,67,12,67],[10,60,12,60],[10,61,12,61],[10,62,12,62],[10,63,12,63],[10,108,12,108],[10,109,12,109],[10,104,12,104],[10,105,12,105],[10,106,12,106],[10,107,12,107],[10,100,12,100],[10,101,12,101],[10,98,12,98],[10,99,12,99],[10,92,12,92],[10,93,12,93],[10,94,12,94],[10,95,12,95],[10,88,12,88],[10,89,12,89],[10,90,12,90],[10,91,12,91],[10,84,12,84],[10,85,12,85],[10,86,12,86],[10,87,12,87],[4,22,9,22],[1,19,3,19],[10,112,12,112],[10,113,12,113],[10,110,12,110],[10,111,12,111],[10,102,12,102],[10,103,12,103],[10,96,12,96],[10,97,12,97],[10,80,12,80],[10,81,12,81],[10,82,12,82],[10,83,12,83],[10,76,12,76],[10,77,12,77],[10,78,12,78],[10,79,12,79],[10,72,12,72],[10,73,12,73],[10,74,12,74],[10,75,12,75],[10,68,12,68],[10,69,12,69]]}
["GHS"]
["HS",null,null,null,null,"Fachhändler:",null,null,null,null,null,null,"Anzahl"]
["HS/Z"]
["Z/HS"]
["Z","Anlagenart:",null,"GHS",null,null,null,null,null,null,null,null,"rdnete Schlüssel"]
["SP","System:",null,"TH6"]
["TH6","Kunde:"]
["2VE"]
["3VE"]
["CARAT P1","Kom.:"]
["CARAT P3","Datum:",null,null,null,null,null,null,null,null,null,null,"Übergeo"]
["Standard","WILKA - VORSPRUNG DURCH QUALITÄT",null,null,null,"."]
["HSR","Position","Schließungs- nummer","Türnummer","Raumbezeichnung","Stückzahl",null,"Artikel",null,"Länge",null,"Färbung "]
["STR",null,null,null,null,"Zylinder","Schlüssel",null,"Dornmaß","A  Aussen","B   Innen",null,"ZAS"]
["CARAT"]
[]
[]
[]
[]
[]
[]
[]
[]
[]
[]
[]
[]
[]
[]
[]
[]
[]
[]
[]
[]
[]
[]
[]
[]
[]
[]
[]
[]
[]
[]
[]
[]
[]
[]
[]
[]
[]
[]
[]
[]
[]
[]
[]
[]
[]
[]
[]
[]
[]
[]
[]
[]
[]
[]
[]
[]
[]
[]
[]
[]
[]
[]
[]
[]
[]
[]
[]
[]
[]
[]
[]
[]
[]
[]
[]
[]
[]
[]
[]
[]
[]
[]
[]
[]
[]
[]
[]
[]
[]
[]
[]
[]
[]
[]
[]
[]
[]
[]
[]
[]
[]
[]
[]
[]
[]
[]
[]
[]
[]
[]
[]
[]
[]
[]
[]
[]
[]
[]
[]
[]
[]
[]
[]
[]
[]
[]
[]
[]
[]
[]
[]
[]
[]
[]
[]
[]
[]
[]
[]
[]
[]
[]
[]
[]
[]
[]
[]
[]
[]
[]
[]
[]
[]
[]
[]
[]
[]
[]
[]
[]
[]
[]
[]
[]
[]
[]
[]
[]
[]
[]
[]
[]
[]
[]
[]
[]
[]
[]
[]
[]
[]
[]
[]
[]
[]
[]
[]
[]
[]
[]
[]
[]
[]
[]
[]
[]
[]
[]
[]
[]
[]
[]
[]
[]
[]
[]
[]
[]
[]
[]
[]
[]
[]
[]
[]
[]
[]
[]
[]
[]
[]
[]
[]
[]
[]
[]
[]
[]
[]
[]
[]
[]
[]
[]
[]
[]
[]
[]
[]
[]
[]
[]
[]
[]
[]
[]
[]
[]
[]
[]
[]
[]
[]
[]
[]
[]
[]
[]
[]
[]
[]
[]
[]
[]
[]
[]
[]
[]
[]
[]
[]
[]
[]
[]
[]
[]
[]
[]
[]
[]
[]
[]
[]
[]
[]
[]
[]
[]
[]
[]
[]
[]
[]
[]
[]
[]
[]
[]
[]
[]
[]
[]
[]
[]
[]
[]
[]
[]
[]
[]
[]
[]
[]
[]
[]
[]
[]
[]
[]
[]
[]
[]
[]
[]
[]
[]
[]
[]
[]
[]
[]
[]
[]
[]
[]
[]
[]
[]
[]
[]
[]
[]
[]
[]
[]
[]
[]
[]
[]
[]
[]
[]
[]
[]
[]
[]
[]
[]
[]
[]
[]
[]
[]
[]
[]
[]
[]
[]
[]
[]
[]
[]
[]
[]
[]
[]
[]
[]
[]
[]
[]
[]
[]
[]
[]
[]
[]
[]
[]
[]
[]
[]
[]
[]
[]
[]
[]
[]
[]
[]
[]
[]
[]
[]
[]
[]
[]
[]
[]
[]
[]
[]
[]
[]
[]
[]
[]
[]
[]
[]
[]
[]
[]
[]
[]
[]
[]
[]
[]
[]
[]
[]
[]
[]
[]
[]
[]
[]
[]
[]
[]
[]
[]
[]
[]
[]
[]
[]
[]
[]
[]
[]
[]
[]
[]
[]
[]
[]
[]
[]
[]
[]
[]
[]
[]
[]
[]
[]
[]
[]
[]
[]
[]
[]
[]
[]
[]
[]
[]
[]
[]
[]
[]
[]
[]
[]
[]
[]
[]
[]
[]
[]
[]
[]
[]
[]
[]
[]
[]
[]
[]
[]
[]
[]
[]
[]
[]
[]
[]
[]
[]
[]
[]
[]
[]
[]
[]
[]
[]
[]
[]
[]
[]
[]
[]
[]
[]
[]
[]
[]
[]
[]
[]
[]
[]
[]
[]
[]
[]
[]
[]
[]
[]
[]
[]
[]
[]
[]
[]
[]
[]
[]
[]
[]
[]
[]
[]
[]
[]
[]
[]
[]
[]
[]
[]
[]
[]
[]
[]
[]
[]
[]
[]
[]
[]
[]
[]
[]
[]
[]
[]
[]
[]
[]
[]
[]
[]
[]
[]
[]
[]
[]
[]
[]
[]
[]
[]
[]
[]
[]
[]
[]
[]
[]
[]
[]
[]
[]
[]
[]
[]
[]
[]
[]
[]
[]
[]
[]
[]
[]
[]
[]
[]
[]
[]
[]
[]
[]
[]
[]
[]
[]
[]
[]
[]
[]
[]
[]
[]
[]
[]
[]
[]
[]
[]
[]
[]
[]
[]
[]
[]
[]
[]
[]
[]
[]
[]
[]
[]
[]
[]
[]
[]
[]
[]
[]
[]
[]
[]
[]
[]
[]
[]
[]
[]
[]
[]
[]
[]
[]
[]
[]
[]
[]
[]
[]
[]
[]
[]
[]
[]
[]
[]
[]
[]
[]
[]
[]
[]
[]
[]
[]
[]
[]
[]
[]
[]
[]
[]
[]
[]
[]
[]
[]
[]
[]
[]
[]
[]
[]
[]
[]
[]
[]
[]
[]
[]
[]
[]
[]
[]
[]
[]
[]
[]
[]
[]
[]
[]
[]
[]
[]
[]
[]
[]
[]
[]
[]
[]
[]
[]
[]
[]
[]
[]
[]
[]
[]
[]
[]
[]
[]
[]
[]
[]
[]
[]
[]
[]
[]
[]
[]
[]
[]
[]
[]
[]
[]
[]
[]
[]
[]
[]
[]
[]
[]
[]
[]
[]
[]
[]
[]
[]
[]
[]
[]
[]
[]
[]
[]
[]
[]
[]
[]
[]
[]
[]
[]
[]
[]
[]
[]
[]
[]
[]
[]
[]
[]
[]
[]
[]
[]
[]
[]
[]
[]
[]
[]
[]
[]
[]
[]
[]
[]
[]
[]
[]
[]
[]
[]
[]
[]
[]
[]
[]
[]
[]
[]
[]
[]
[]
[]
[]
[]
[]
[]
[]
[]
[]
[]
[]
[]
[]
[]
[]
[]
[]
[]
[]
[]
[]
[]
[]
[]
[]
[]
[]
[]
[]
[]
[]
[]
[]
[]
[]
[]
[]
[]
[]
[]
[]
[]
[]
[]
[]
[]
[]
[]
[]
[]
[]
[]
[]
[]
[]
[]
[]
[]
[]
[]
[]
[]
[]
[]
[]
[]
[]
[]
[]
[]
[]
[]
[]
[]
[]
[]
[]
[]
[]
[]
[]
[]
[]
[]
[]
[]
[]
[]
[]
[]
[]
[]
[]
[]
[]
[]
[]
[]
[]
[]
[]
[]
[]
[]
[]
[]
[]
[]
[]
[]
[]
[]
[]
[]
[]
[]
[]
[]
[]
[]
[]
[]
[]
[]
[]
[]
[]
[]
[]
[]
[]
[]
[]
[]
[]
[]
[]
[]
[]
[]
[]
[]
[]
[]
[]
[]
[]
[]
[]
[]
[]
[]
[]
[]
[]
[]
[]
[]
[]
[]
[]
[]
[]
[]
[]
[]
[]
[]
[]
[]
[]
[]
[]
[]
[]
[]
[]
[]
[]
[]
[]
[]
[]
[]
[]
[]
[]
[]
[]
[]
[]
[]
[]
[]
[]
[]
[]
[]
[]
[]
[]
[]
[]
[]
[]
[]
[]
[]
[]
[]
[]
[]
[]
[]
[]
[]
[]
[]
[]
[]
[]
[]
[]
[]
[]
[]
[]
[]
[]
[]
[]
[]
[]
[]
[]
[]
[]
[]
[]
[]
[]
[]
[]
[]
[]
[]
[]
[]
[]
[]
[]
[]
[]
[]
[]
[]
[]
[]
[]
[]
[]
[]
[]
[]
[]
[]
[]
[]
[]
[]
[]
[]
[]
[]
[]
[]
[]
[]
[]
[]
[]
[]
[]
[]
[]
[]
[]
[]
[]
[]
[]
[]
[]
[]
[]
[]
[]
[]
[]
[]
[]
[]
[]
[]
[]
[]
[]
[]
[]
[]
[]
[]
[]
[]
[]
[]
[]
[]
[]
[]
[]
[]
[]
[]
[]
[]
[]
[]
[]
[]
[]
[]
[]
[]
[]
[]
[]
[]
[]
[]
[]
[]
[]
[]
[]
[]
[]
[]
[]
[]
[]
[]
[]
[]
[]
[]
[]
[]
[]
[]
[]
[]
[]
[]
[]
[]
[]
[]
[]
[]
[]
[]
[]
[]
[]
[]
[]
[]
[]
[]
[]
[]
[]
[]
[]
[]
[]
[]
[]
[]
[]
[]
[]
[]
[]
[]
[]
[]
[]
[]
[]
[]
[]
[]
[]
[]
[]
[]
[]
[]
[]
[]
[]
[]
[]
[]
[]
[]
[]
[]
[]
[]
[]
[]
[]
[]
[]
[]
[]
[]
[]
[]
[]
[]
[]
[]
[]
[]
[]
[]
[]
[]
[]
[]
[]
[]
[]
[]
[]
[]
[]
[]
[]
[]
[]
[]
[]
[]
[]
[]
[]
[]
[]
[]
[]
[]
[]
[]
[]
[]
[]
[]
[]
[]
[]
[]
[]
[]
[]
[]
[]
[]
[]
[]
[]
[]
[]
[]
[]
[]
[]
[]
[]
[]
[]
[]
[]
[]
[]
[]
[]
[]
[]
[]
[]
[]
[]
[]
[]
[]
[]
[]
[]
[]
[]
[]
[]
[]
[]
[]
[]
[]
[]
[]
[]
[]
[]
[]
[]
[]
[]
[]
[]
[]
[]
[]
[]
[]
[]
[]
[]
[]
[]
[]
[]
[]
[]
[]
[]
[]
[]
[]
[]
[]
[]
[]
[]
[]
[]
[]
[]
[]
[]
[]
[]
[]
[]
[]
[]
[]
[]
[]
[]
[]
[]
[]
[]
[]
[]
[]
[]
[]
[]
[]
[]
[]
[]
[]
[]
[]
[]
[]
[]
[]
[]
[]
[]
[]
[]
[]
[]
[]
[]
[]
[]
[]
[]
[]
[]
[]
[]
[]
[]
[]
[]
[]
[]
[]
[]
[]
[]
[]
[]
[]
[]
[]
[]
[]
[]
[]
[]
[]
[]
[]
[]
[]
[]
[]
[]
[]
[]
[]
[]
[]
[]
[]
[]
[]
[]
[]
[]
[]
[]
[]
[]
[]
[]
[]
[]
[]
[]
[]
[]
[]
[]
[]
[]
[]
[]
[]
[]
[]
[]
[]
[]
[]
[]
[]
[]
[]
[]
[]
[]
[]
[]
[]
[]
[]
[]
[]
[]
[]
[]
[]
[]
[]
[]
[]
[]
[]
[]
[]
[]
[]
[]
[]
[]
[]
[]
[]
[]
[]
[]
[]
[]
[]
[]
[]
[]
[]
[]
[]
[]
[]
[]
[]
[]
[]
[]
[]
[]
[]
[]
[]
[]
[]
[]
[]
[]
[]
[]
[]
[]
[]
[]
[]
[]
[]
[]
[]
[]
[]
[]
[]
[]
[]
[]
[]
[]
[]
[]
[]
[]
[]
[]
[]
[]
[]
[]
[]
[]
[]
[]
[]
[]
[]
[]
[]
[]
[]
[]
[]
[]
[]
[]
[]
[]
[]
[]
[]
[]
[]
[]
[]
[]
[]
[]
[]
[]
[]
[]
[]
[]
[]
[]
[]
[]
[]
[]
[]
[]
[]
[]
[]
[]
[]
[]
[]
[]
[]
[]
[]
[]
[]
[]
[]
[]
[]
[]
[]
[]
[]
[]
[]
[]
[]
[]
[]
[]
[]
[]
[]
[]
[]
[]
[]
[]
[]
[]
[]
[]
[]
[]
[]
[]
[]
[]
[]
[]
[]
[]
[]
[]
[]
[]
[]
[]
[]
[]
[]
[]
[]
[]
[]
[]
[]
[]
[]
[]
[]
[]
[]
[]
[]
[]
[]
[]
[]
[]
[]
[]
[]
[]
[]
[]
[]
[]
[]
[]
[]
[]
[]
[]
[]
[]
[]
[]
[]
[]
[]
[]
[]
[]
[]
[]
[]
[]
[]
[]
[]
[]
[]
[]
[]
[]
[]
[]
[]
[]
[]
[]
[]
[]
[]
[]
[]
[]
[]
[]
[]
[]
[]
[]
[]
[]
[]
[]
[]
[]
[]
[]
[]
[]
[]
[]
[]
[]
[]
[]
[]
[]
[]
[]
[]
[]
[]
[]
[]
[]
[]
[]
[]
[]
[]
[]
[]
[]
[]
[]
[]
[]
[]
[]
[]
[]
[]
[]
[]
[]
[]
[]
[]
[]
[]
[]
[]
[]
[]
[]
[]
[]
[]
[]
[]
[]
[]
[]
[]
[]
[]
[]
[]
[]
[]
[]
[]
[]
[]
[]
[]
[]
[]
[]
[]
[]
[]
[]
[]
[]
[]
[]
[]
[]
[]
[]
[]
[]
[]
[]
[]
[]
[]
[]
[]
[]
[]
[]
[]
[]
[]
[]
[]
[]
[]
[]
[]
[]
[]
[]
[]
[]
[]
[]
[]
[]
[]
[]
[]
[]
[]
[]
[]
[]
[]
[]
[]
[]
[]
[]
[]
[]
[]
[]
[]
[]
[]
[]
[]
[]
[]
[]
[]
[]
[]
[]
[]
[]
[]
[]
[]
[]
[]
[]
[]
[]
[]
[]
[]
[]
[]
[]
[]
[]
[]
[]
[]
[]
[]
[]
[]
[]
[]
[]
[]
[]
[]
[]
[]
[]
[]
[]
[]
[]
[]
[]
[]
[]
[]
[]
[]
[]
[]
[]
[]
[]
[]
[]
[]
[]
[]
[]
[]
[]
[]
[]
[]
[]
[]
[]
[]
[]
[]
[]
[]
[]
[]
[]
[]
[]
[]
[]
[]
[]
[]
[]
[]
[]
[]
[]
[]
[]
[]
[]
[]
[]
[]
[]
[]
[]
[]
[]
[]
[]
[]
[]
[]
[]
[]
[]
[]
[]
[]
[]
[]
[]
[]
[]
[]
[]
[]
[]
[]
[]
[]
[]
[]
[]
[]
[]
[]
[]
[]
[]
[]
[]
[]
[]
[]
[]
[]
[]
[]
[]
[]
[]
[]
[]
[]
[]
[]
[]
[]
[]
[]
[]
[]
[]
[]
[]
[]
[]
[]
[]
[]
[]
[]
[]
[]
[]
[]
[]
[]
[]
[]
[]
[]
[]
[]
[]
[]
[]
[]
[]
[]
[]
[]
[]
[]
[]
[]
[]
[]
[]
[]
[]
[]
[]
[]
[]
[]
[]
[]
[]
[]
[]
[]
[]
[]
[]
[]
[]
[]
[]
[]
[]
[]
[]
[]
[]
[]
[]
[]
[]
[]
[]
[]
[]
[]
[]
[]
[]
[]
[]
[]
[]
[]
[]
[]
[]
[]
[]
[]
[]
[]
[]
[]
[]
[]
[]
[]
[]
[]
[]
[]
[]
[]
[]
[]
[]
[]
[]
[]
[]
[]
[]
[]
[]
[]
[]
[]
[]
[]
[]
[]
[]
[]
[]
[]
[]
[]
[]
[]
[]
[]
[]
[]
[]
[]
[]
[]
[]
[]
[]
[]
[]
[]
[]
[]
[]
[]
[]
[]
[]
[]
[]
[]
[]
[]
[]
[]
[]
[]
[]
[]
[]
[]
[]
[]
[]
[]
[]
[]
[]
[]
[]
[]
[]
[]
[]
[]
[]
[]
[]
[]
[]
[]
[]
[]
[]
[]
[]
[]
[]
[]
[]
[]
[]
[]
[]
[]
[]
[]
[]
[]
[]
[]
[]
[]
[]
[]
[]
[]
[]
[]
[]
[]
[]
[]
[]
[]
[]
[]
[]
[]
[]
[]
[]
[]
[]
[]
[]
[]
[]
[]
[]
[]
[]
[]
[]
[]
[]
[]
[]
[]
[]
[]
[]
[]
[]
[]
[]
[]
[]
[]
[]
[]
[]
[]
[]
[]
[]
[]
[]
[]
[]
[]
[]
[]
[]
[]
[]
[]
[]
[]
[]
[]
[]
[]
[]
[]
[]
[]
[]
[]
[]
[]
[]
[]
[]
[]
[]
[]
[]
[]
[]
[]
[]
[]
[]
[]
[]
[]
[]
[]
[]
[]
[]
[]
[]
[]
[]
[]
[]
[]
[]
[]
[]
[]
[]
[]
[]
[]
[]
[]
[]
[]
[]
[]
[]
[]
[]
[]
[]
[]
[]
[]
[]
[]
[]
[]
[]
[]
[]
[]
[]
[]
[]
[]
[]
[]
[]
[]
[]
[]
[]
[]
[]
[]
[]
[]
[]
[]
[]
[]
[]
[]
[]
[]
[]
[]
[]
[]
[]
[]
[]
[]
[]
[]
[]
[]
[]
[]
[]
[]
[]
[]
[]
[]
[]
[]
[]
[]
[]
[]
[]
[]
[]
[]
[]
[]
[]
[]
[]
[]
[]
[]
[]
[]
[]
[]
[]
[]
[]
[]
[]
[]
[]
[]
[]
[]
[]
[]
[]
[]
[]
[]
[]
[]
[]
[]
[]
[]
[]
[]
[]
[]
[]
[]
[]
[]
[]
[]
[]
[]
[]
[]
[]
[]
[]
[]
[]
[]
[]
[]
[]
[]
[]
[]
[]
[]
[]
[]
[]
[]
[]
[]
[]
[]
[]
[]
[]
[]
[]
[]
[]
[]
[]
[]
[]
[]
[]
[]
[]
[]
[]
[]
[]
[]
[]
[]
[]
[]
[]
[]
[]
[]
[]
[]
[]
[]
[]
[]
[]
[]
[]
[]
[]
[]
[]
[]
[]
[]
[]
[]
[]
[]
[]
[]
[]
[]
[]
[]
[]
[]
[]
[]
[]
[]
[]
[]
[]
[]
[]
[]
[]
[]
[]
[]
[]
[]
[]
[]
[]
[]
[]
[]
[]
[]
[]
[]
[]
[]
[]
[]
[]
[]
[]
[]
[]
[]
[]
[]
[]
[]
[]
[]
[]
[]
[]
[]
[]
[]
[]
[]
[]
[]
[]
[]
[]
[]
[]
[]
[]
[]
[]
[]
[]
[]
[]
[]
[]
[]
[]
[]
[]
[]
[]
[]
[]
[]
[]
[]
[]
[]
[]
[]
[]
[]
[]
[]
[]
[]
[]
[]
[]
[]
[]
[]
[]
[]
[]
[]
[]
[]
[]
[]
[]
[]
[]
[]
[]
[]
[]
[]
[]
[]
[]
[]
[]
[]
[]
[]
[]
[]
[]
[]
[]
[]
[]
[]
[]
[]
[]
[]
[]
[]
[]
[]
[]
[]
[]
[]
[]
[]
[]
[]
[]
[]
[]
[]
[]
[]
[]
[]
[]
[]
[]
[]
[]
[]
[]
[]
[]
[]
[]
[]
[]
[]
[]
[]
[]
[]
[]
[]
[]
[]
[]
[]
[]
[]
[]
[]
[]
[]
[]
[]
[]
[]
[]
[]
[]
[]
[]
[]
[]
[]
[]
[]
[]
[]
[]
[]
[]
[]
[]
[]
[]
[]
[]
[]
[]
[]
[]
[]
[]
[]
[]
[]
[]
[]
[]
[]
[]
[]
[]
[]
[]
[]
[]
[]
[]
[]
[]
[]
[]
[]
[]
[]
[]
[]
[]
[]
[]
[]
[]
[]
[]
[]
[]
[]
[]
[]
[]
[]
[]
[]
[]
[]
[]
[]
[]
[]
[]
[]
[]
[]
[]
[]
[]
[]
[]
[]
[]
[]
[]
[]
[]
[]
[]
[]
[]
[]
[]
[]
[]
[]
[]
[]
[]
[]
[]
[]
[]
[]
[]
[]
[]
[]
[]
[]
[]
[]
[]
[]
[]
[]
[]
[]
[]
[]
[]
[]
[]
[]
[]
[]
[]
[]
[]
[]
[]
[]
[]
[]
[]
[]
[]
[]
[]
[]
[]
[]
[]
[]
[]
[]
[]
[]
[]
[]
[]
[]
[]
[]
[]
[]
[]
[]
[]
[]
[]
[]
[]
[]
[]
[]
[]
[]
[]
[]
[]
[]
[]
[]
[]
[]
[]
[]
[]
[]
[]
[]
[]
[]
[{"$f":"VLOOKUP($D$6,Mechanisch!$A$4:$BQ$13,2,FALSE)","v":1399}]
[{"$f":"VLOOKUP($D$6,Mechanisch!$A$4:$BQ$13,3,FALSE)","v":1400}]
[{"$f":"VLOOKUP($D$6,Mechanisch!$A$4:$BQ$13,4,FALSE)","v":1463}]
[{"$f":"VLOOKUP($D$6,Mechanisch!$A$4:$BQ$13,5,FALSE)","v":1408}]
[{"$f":"IF(VLOOKUP($D$6,Mechanisch!$A$4:$BQ$13,6,FALSE)=0,\"\",VLOOKUP($D$6,Mechanisch!$A$4:$BQ$13,6,FALSE))","v":1478}]
[{"$f":"VLOOKUP($D$6,Mechanisch!$A$4:$BQ$13,7,FALSE)","v":1479}]
[{"$f":"VLOOKUP($D$6,Mechanisch!$A$4:$BQ$13,8,FALSE)","v":1480}]
[{"$f":"VLOOKUP($D$6,Mechanisch!$A$4:$BQ$13,9,FALSE)","v":1481}]
[{"$f":"VLOOKUP($D$6,Mechanisch!$A$4:$BQ$13,10,FALSE)","v":1483}]
[{"$f":"VLOOKUP($D$6,Mechanisch!$A$4:$BQ$13,11,FALSE)","v":1488}]
[{"$f":"VLOOKUP($D$6,Mechanisch!$A$4:$BQ$13,12,FALSE)","v":1489}]
[{"$f":"VLOOKUP($D$6,Mechanisch!$A$4:$BQ$13,13,FALSE)","v":1405}]
[{"$f":"VLOOKUP($D$6,Mechanisch!$A$4:$BQ$13,14,FALSE)","v":1406}]
[{"$f":"VLOOKUP($D$6,Mechanisch!$A$4:$BQ$13,15,FALSE)","v":1407}]
[{"$f":"VLOOKUP($D$6,Mechanisch!$A$4:$BQ$13,16,FALSE)","v":1484}]
[{"$f":"VLOOKUP($D$6,Mechanisch!$A$4:$BQ$13,17,FALSE)","v":1474}]
[{"$f":"VLOOKUP($D$6,Mechanisch!$A$4:$BQ$13,18,FALSE)","v":1475}]
[{"$f":"VLOOKUP($D$6,Mechanisch!$A$4:$BQ$13,19,FALSE)","v":1312}]
[{"$f":"VLOOKUP($D$6,Mechanisch!$A$4:$BQ$13,20,FALSE)","v":1319}]
[{"$f":"VLOOKUP($D$6,Mechanisch!$A$4:$BQ$13,21,FALSE)","v":1398}]
[{"$f":"VLOOKUP($D$6,Mechanisch!$A$4:$BQ$13,22,FALSE)","v":1410}]
[{"$f":"VLOOKUP($D$6,Mechanisch!$A$4:$BQ$13,23,FALSE)","v":1415}]
[{"$f":"VLOOKUP($D$6,Mechanisch!$A$4:$BQ$13,24,FALSE)","v":0}]
[{"$f":"VLOOKUP($D$6,Mechanisch!$A$4:$BQ$13,25,FALSE)","v":0}]
[{"$f":"VLOOKUP($D$6,Mechanisch!$A$4:$BQ$13,26,FALSE)","v":0}]
[{"$f":"VLOOKUP($D$6,Mechanisch!$A$4:$BQ$13,27,FALSE)","v":0}]
[{"$f":"VLOOKUP($D$6,Mechanisch!$A$4:$BQ$13,28,FALSE)","v":"B400"}]
[{"$f":"VLOOKUP($D$6,Mechanisch!$A$4:$BQ$13,29,FALSE)","v":"B405"}]
[{"$f":"VLOOKUP($D$6,Mechanisch!$A$4:$BQ$13,30,FALSE)","v":"B410"}]
[{"$f":"VLOOKUP($D$6,Mechanisch!$A$4:$BQ$13,31,FALSE)","v":"B463"}]
[{"$f":"VLOOKUP($D$6,Mechanisch!$A$4:$BQ$13,32,FALSE)","v":"K400"}]
[{"$f":"VLOOKUP($D$6,Mechanisch!$A$4:$BQ$13,33,FALSE)","v":"K405"}]
[{"$f":"VLOOKUP($D$6,Mechanisch!$A$4:$BQ$13,34,FALSE)","v":"K410"}]
[{"$f":"VLOOKUP($D$6,Mechanisch!$A$4:$BQ$13,35,FALSE)","v":"K463"}]
[{"$f":"VLOOKUP($D$6,Mechanisch!$A$4:$BQ$13,36,FALSE)","v":2201}]
[{"$f":"VLOOKUP($D$6,Mechanisch!$A$4:$BQ$13,37,FALSE)","v":1250}]
[{"$f":"VLOOKUP($D$6,Mechanisch!$A$4:$BQ$13,38,FALSE)","v":1251}]
[{"$f":"VLOOKUP($D$6,Mechanisch!$A$4:$BQ$13,39,FALSE)","v":1253}]
[{"$f":"VLOOKUP($D$6,Mechanisch!$A$4:$BQ$13,40,FALSE)","v":500}]
[{"$f":"VLOOKUP($D$6,Mechanisch!$A$4:$BQ$13,41,FALSE)","v":"500F"}]
[{"$f":"VLOOKUP($D$6,Mechanisch!$A$4:$BQ$13,42,FALSE)","v":501}]
[{"$f":"VLOOKUP($D$6,Mechanisch!$A$4:$BQ$13,43,FALSE)","v":503}]
[{"$f":"VLOOKUP($D$6,Mechanisch!$A$4:$BQ$13,44,FALSE)","v":560}]
[{"$f":"VLOOKUP($D$6,Mechanisch!$A$4:$BQ$13,45,FALSE)","v":586}]
[{"$f":"VLOOKUP($D$6,Mechanisch!$A$4:$BQ$13,46,FALSE)","v":587}]
[{"$f":"VLOOKUP($D$6,Mechanisch!$A$4:$BQ$13,47,FALSE)","v":2530}]
[{"$f":"VLOOKUP($D$6,Mechanisch!$A$4:$BQ$13,48,FALSE)","v":2532}]
[{"$f":"VLOOKUP($D$6,Mechanisch!$A$4:$BQ$13,49,FALSE)","v":2534}]
[{"$f":"VLOOKUP($D$6,Mechanisch!$A$4:$BQ$13,50,FALSE)","v":2613}]
[{"$f":"VLOOKUP($D$6,Mechanisch!$A$4:$BQ$13,51,FALSE)","v":593}]
[{"$f":"VLOOKUP($D$6,Mechanisch!$A$4:$BQ$13,52,FALSE)","v":598}]
[{"$f":"VLOOKUP($D$6,Mechanisch!$A$4:$BQ$13,53,FALSE)","v":692}]
[{"$f":"VLOOKUP($D$6,Mechanisch!$A$4:$BQ$13,54,FALSE)","v":550}]
[{"$f":"VLOOKUP($D$6,Mechanisch!$A$4:$BQ$13,55,FALSE)","v":546}]
[{"$f":"VLOOKUP($D$6,Mechanisch!$A$4:$BQ$13,56,FALSE)","v":548}]
[{"$f":"VLOOKUP($D$6,Mechanisch!$A$4:$BQ$13,57,FALSE)","v":549}]
[{"$f":"VLOOKUP($D$6,Mechanisch!$A$4:$BQ$13,58,FALSE)","v":592}]
[{"$f":"VLOOKUP($D$6,Mechanisch!$A$4:$BQ$13,59,FALSE)","v":520}]
[{"$f":"VLOOKUP($D$6,Mechanisch!$A$4:$BQ$13,60,FALSE)","v":530}]
[{"$f":"VLOOKUP($D$6,Mechanisch!$A$4:$BQ$13,61,FALSE)","v":1304}]
[{"$f":"VLOOKUP($D$6,Mechanisch!$A$4:$BQ$13,62,FALSE)","v":1307}]
[{"$f":"VLOOKUP($D$6,Mechanisch!$A$4:$BQ$13,63,FALSE)","v":1380}]
[{"$f":"VLOOKUP($D$6,Mechanisch!$A$4:$BQ$13,64,FALSE)","v":1401}]
[{"$f":"VLOOKUP($D$6,Mechanisch!$A$4:$BQ$13,65,FALSE)","v":1413}]
[{"$f":"VLOOKUP($D$6,Mechanisch!$A$4:$BQ$13,66,FALSE)","v":1477}]
[{"$f":"VLOOKUP($D$6,Mechanisch!$A$4:$BQ$13,67,FALSE)","v":1482}]
[{"$f":"VLOOKUP($D$6,Mechanisch!$A$4:$BQ$13,68,FALSE)","v":1486}]
[{"$f":"VLOOKUP($D$6,Mechanisch!$A$4:$BQ$13,69,FALSE)","v":1487}]
[{"$f":"VLOOKUP($D$6,Elektronik!$A$4:$BG$13,2,FALSE)","v":"E204"}]
[{"$f":"VLOOKUP($D$6,Elektronik!$A$4:$BG$13,3,FALSE)","v":"E203"}]
[{"$f":"VLOOKUP($D$6,Elektronik!$A$4:$BG$13,4,FALSE)","v":"E207"}]
[{"$f":"VLOOKUP($D$6,Elektronik!$A$4:$BG$13,5,FALSE)","v":"E213"}]
[{"$f":"VLOOKUP($D$6,Elektronik!$A$4:$BG$13,6,FALSE)","v":"E214"}]
[{"$f":"VLOOKUP($D$6,Elektronik!$A$4:$BG$13,7,FALSE)","v":"E215"}]
[{"$f":"VLOOKUP($D$6,Elektronik!$A$4:$BG$13,8,FALSE)","v":"E831"}]
[{"$f":"VLOOKUP($D$6,Elektronik!$A$4:$BG$13,9,FALSE)","v":"E832"}]
[{"$f":"VLOOKUP($D$6,Elektronik!$A$4:$BG$13,10,FALSE)","v":"E820"}]
[{"$f":"VLOOKUP($D$6,Elektronik!$A$4:$BG$13,11,FALSE)","v":"E821"}]
[{"$f":"VLOOKUP($D$6,Elektronik!$A$4:$BG$13,12,FALSE)","v":"E931"}]
[{"$f":"VLOOKUP($D$6,Elektronik!$A$4:$BG$13,13,FALSE)","v":"E932"}]
[{"$f":"VLOOKUP($D$6,Elektronik!$A$4:$BG$13,14,FALSE)","v":"E935"}]
[{"$f":"VLOOKUP($D$6,Elektronik!$A$4:$BG$13,15,FALSE)","v":"E936"}]
[{"$f":"VLOOKUP($D$6,Elektronik!$A$4:$BG$13,16,FALSE)","v":"E920"}]
[{"$f":"VLOOKUP($D$6,Elektronik!$A$4:$BG$13,17,FALSE)","v":"E821"}]
[{"$f":"VLOOKUP($D$6,Elektronik!$A$4:$BG$13,18,FALSE)","v":"E881"}]
[{"$f":"VLOOKUP($D$6,Elektronik!$A$4:$BG$13,19,FALSE)","v":"E837"}]
[{"$f":"VLOOKUP($D$6,Elektronik!$A$4:$BG$13,20,FALSE)","v":"E850"}]
[{"$f":"VLOOKUP($D$6,Elektronik!$A$4:$BG$13,21,FALSE)","v":"E855"}]
[{"$f":"VLOOKUP($D$6,Elektronik!$A$4:$BG$13,22,FALSE)","v":"E950"}]
[{"$f":"VLOOKUP($D$6,Elektronik!$A$4:$BG$13,23,FALSE)","v":"E895"}]
[{"$f":"VLOOKUP($D$6,Elektronik!$A$4:$BG$13,24,FALSE)","v":"E871"}]
[{"$f":"VLOOKUP($D$6,Elektronik!$A$4:$BG$13,25,FALSE)","v":"SE60"}]
[{"$f":"VLOOKUP($D$6,Elektronik!$A$4:$BG$13,26,FALSE)","v":"E890"}]
[{"$f":"VLOOKUP($D$6,Elektronik!$A$4:$BG$13,27,FALSE)","v":"E891"}]
[{"$f":"VLOOKUP($D$6,Elektronik!$A$4:$BG$13,28,FALSE)","v":"E892"}]
[{"$f":"VLOOKUP($D$6,Elektronik!$A$4:$BG$13,29,FALSE)","v":"E894"}]
[{"$f":"VLOOKUP($D$6,Elektronik!$A$4:$BG$13,30,FALSE)","v":"E896"}]
[{"$f":"VLOOKUP($D$6,Elektronik!$A$4:$BG$13,31,FALSE)","v":"E898"}]
[{"$f":"VLOOKUP($D$6,Elektronik!$A$4:$BG$13,32,FALSE)","v":"E624ST"}]
[{"$f":"VLOOKUP($D$6,Elektronik!$A$4:$BG$13,33,FALSE)","v":"E624UP"}]
[{"$f":"VLOOKUP($D$6,Elektronik!$A$4:$BG$13,34,FALSE)","v":"E680"}]
[{"$f":"VLOOKUP($D$6,Elektronik!$A$4:$BG$13,35,FALSE)","v":"M550"}]
[{"$f":"VLOOKUP($D$6,Elektronik!$A$4:$BG$13,36,FALSE)","v":"M551"}]
[{"$f":"VLOOKUP($D$6,Elektronik!$A$4:$BG$13,37,FALSE)","v":"M552"}]
[{"$f":"VLOOKUP($D$6,Elektronik!$A$4:$BG$13,38,FALSE)","v":"M553"}]
[{"$f":"VLOOKUP($D$6,Elektronik!$A$4:$BG$13,39,FALSE)","v":"M554"}]
[{"$f":"VLOOKUP($D$6,Elektronik!$A$4:$BG$13,40,FALSE)","v":"M555"}]
[{"$f":"VLOOKUP($D$6,Elektronik!$A$4:$BG$13,41,FALSE)","v":"M556"}]
[{"$f":"VLOOKUP($D$6,Elektronik!$A$4:$BG$13,42,FALSE)","v":"M557"}]
[{"$f":"VLOOKUP($D$6,Elektronik!$A$4:$BG$13,43,FALSE)","v":"M558"}]
[{"$f":"VLOOKUP($D$6,Elektronik!$A$4:$BG$13,44,FALSE)","v":"M540"}]
[{"$f":"VLOOKUP($D$6,Elektronik!$A$4:$BG$13,45,FALSE)","v":"M541"}]
[{"$f":"VLOOKUP($D$6,Elektronik!$A$4:$BG$13,46,FALSE)","v":0}]
[{"$f":"VLOOKUP($D$6,Elektronik!$A$4:$BG$13,47,FALSE)","v":0}]
[{"$f":"VLOOKUP($D$6,Elektronik!$A$4:$BG$13,48,FALSE)","v":0}]
[{"$f":"VLOOKUP($D$6,Elektronik!$A$4:$BG$13,49,FALSE)","v":0}]
[{"$f":"VLOOKUP($D$6,Elektronik!$A$4:$BG$13,50,FALSE)","v":0}]
[{"$f":"VLOOKUP($D$6,Elektronik!$A$4:$BG$13,51,FALSE)","v":0}]
[{"$f":"VLOOKUP($D$6,Elektronik!$A$4:$BG$13,52,FALSE)","v":0}]
[{"$f":"VLOOKUP($D$6,Elektronik!$A$4:$BG$13,53,FALSE)","v":0}]
[{"$f":"VLOOKUP($D$6,Elektronik!$A$4:$BG$13,54,FALSE)","v":0}]
[{"$f":"VLOOKUP($D$6,Elektronik!$A$4:$BG$13,55,FALSE)","v":0}]
[{"$f":"VLOOKUP($D$6,Elektronik!$A$4:$BG$13,56,FALSE)","v":0}]
[{"$f":"VLOOKUP($D$6,Elektronik!$A$4:$BG$13,57,FALSE)","v":0}]
[{"$f":"VLOOKUP($D$6,Elektronik!$A$4:$BG$13,58,FALSE)","v":0}]
[{"$f":"VLOOKUP($D$6,Elektronik!$A$4:$BG$13,59,FALSE)","v":0}]
[{"$f":"VLOOKUP($D$6,Elektronik!$A$4:$BG$13,60,FALSE)","v":{"$error":"#REF!"}}]
[{"$f":"VLOOKUP($D$6,Elektronik!$A$4:$BG$13,61,FALSE)","v":{"$error":"#REF!"}}]
[{"$f":"VLOOKUP($D$6,Elektronik!$A$4:$BG$13,62,FALSE)","v":{"$error":"#REF!"}}]
[{"$f":"VLOOKUP($D$6,Elektronik!$A$4:$BG$13,63,FALSE)","v":{"$error":"#REF!"}}]

{"sheet":"Artikelliste","index":3,"n_rows":164,"n_cols":12,"rows_kept":164,"cut":false,"hidden":false,"merged":[[179,10,179,12],[178,10,178,12],[177,10,177,12],[176,10,176,12],[175,10,175,12],[174,10,174,12],[173,10,173,12],[172,10,172,12],[171,10,171,12],[188,10,188,12],[187,10,187,12],[186,10,186,12],[185,10,185,12],[184,10,184,12],[183,10,183,12],[182,10,182,12],[181,10,181,12],[180,10,180,12],[170,10,170,12],[160,10,160,12],[161,0,161,12],[161,14,161,16],[162,10,162,12],[162,14,162,16],[163,10,163,12],[163,14,163,16],[164,10,164,12],[164,14,164,16],[169,10,169,12],[168,10,168,12],[165,10,165,12],[165,14,165,16],[166,10,166,12],[167,10,167,12],[154,10,154,12],[154,14,154,16],[155,10,155,12],[155,14,155,16],[156,10,156,12],[156,14,156,16],[157,10,157,12],[158,10,158,12],[159,10,159,12],[151,0,151,12],[151,14,151,16],[152,10,152,12],[152,14,152,16],[153,10,153,12],[145,10,145,12],[124,10,124,12],[130,10,130,12],[72,10,72,12],[134,14,134,16],[139,10,139,12],[139,14,139,16],[135,10,135,12],[135,14,135,16],[138,10,138,12],[138,14,138,16],[144,14,144,16],[141,10,141,12],[141,14,141,16],[143,10,143,12],[133,14,133,16],[132,14,132,16],[126,10,126,12],[127,10,127,12],[62,14,62,16],[63,14,63,16],[67,10,67,12],[67,14,67,16],[115,0,115,12],[115,14,115,16],[123,10,123,12],[122,14,122,16],[123,14,123,16],[73,14,73,16],[69,0,69,12],[69,14,69,16],[70,10,70,12],[70,14,70,16],[71,14,71,16],[71,10,71,12],[75,14,75,16],[74,10,74,12],[121,10,121,12],[120,10,120,12],[119,10,119,12],[118,10,118,12],[117,10,117,12],[116,10,116,12],[68,14,68,16],[64,10,64,12],[65,10,65,12],[65,14,65,16],[66,10,66,12],[66,14,66,16],[68,10,68,12],[41,14,41,16],[28,10,28,12],[28,14,28,16],[39,0,39,12],[39,14,39,16],[40,14,40,16],[42,10,42,12],[42,14,42,16],[43,10,43,12],[43,14,43,16],[44,14,44,16],[45,14,45,16],[48,14,48,16],[49,10,49,12],[49,14,49,16],[50,10,50,12],[50,14,50,16],[0,0,1,12],[2,10,3,12],[12,10,12,12],[13,10,13,12],[14,10,14,12],[14,14,14,16],[11,14,11,16],[10,14,10,16],[2,0,2,9],[11,10,11,12],[10,10,10,12],[5,10,5,12],[3,14,3,16],[4,0,4,12],[6,10,6,12],[7,10,7,12],[60,10,60,12],[60,14,60,16],[24,10,24,12],[56,14,56,16],[58,10,58,12],[58,14,58,16],[24,14,24,16],[20,10,20,12],[20,14,20,16],[19,10,19,12],[32,14,32,16],[30,10,30,12],[30,14,30,16],[31,10,31,12],[31,14,31,16],[9,10,9,12],[74,14,74,16],[9,14,9,16],[19,14,19,16],[15,14,15,16],[17,14,17,16],[23,14,23,16],[27,10,27,12],[27,14,27,16],[26,14,26,16],[25,10,25,12],[25,14,25,16],[40,10,40,12],[16,0,16,12],[15,10,15,12],[16,14,16,16],[17,10,17,12],[18,10,18,12],[63,10,63,12],[29,14,29,16],[51,10,51,12],[51,14,51,16],[52,10,52,12],[32,10,32,12],[148,14,148,20],[149,0,149,9],[149,11,149,12],[76,10,76,12],[76,14,76,16],[77,10,77,12],[77,14,77,16],[78,10,78,12],[78,14,78,16],[146,10,146,12],[146,14,146,16],[147,10,147,12],[147,14,147,16],[107,11,107,12],[108,11,108,12],[148,10,148,12],[105,11,105,12],[106,11,106,12],[100,11,100,12],[143,14,143,16],[142,10,142,12],[140,10,140,12],[133,10,133,12],[8,10,8,12],[104,11,104,12],[86,0,86,9],[41,0,41,12],[26,10,26,12],[23,0,23,12],[45,0,45,12],[102,11,102,12],[103,11,103,12],[61,10,61,12],[79,0,79,9],[44,10,44,12],[46,10,46,12],[48,10,48,12],[29,0,29,12],[21,10,21,12],[22,10,22,12],[55,10,55,12],[75,10,75,12],[73,10,73,12],[62,0,62,12],[38,10,38,12],[56,10,56,12],[33,10,33,12],[33,14,33,16],[144,10,144,12],[129,10,129,12],[128,10,128,12],[150,11,150,12],[79,11,79,12],[136,10,136,12],[137,10,137,12],[86,11,86,12],[132,0,132,12],[101,11,101,12],[109,11,109,12],[110,11,110,12],[99,11,99,12],[134,10,134,12],[122,10,122,12],[125,10,125,12],[131,10,131,12],[38,14,38,16],[34,0,34,12],[34,14,34,16],[35,10,35,12],[35,14,35,16],[36,10,36,12],[36,14,36,16],[61,14,61,16],[59,10,59,12],[55,14,55,16],[57,0,57,12],[57,14,57,16],[37,10,37,12],[37,14,37,16],[52,14,52,16],[53,10,53,12],[53,14,53,16],[54,10,54,12],[54,14,54,16],[46,14,46,16],[47,10,47,12],[47,14,47,16]]}
["Schließanlagen-Artikel"]
[]
["Schließanlagensysteme",null,null,null,null,null,null,null,null,null,"Beschreibung"]
[]
["Doppelzylinder"]
[null,null,1399,1399,null,null,null,null,null,null,"Profildoppelzylinder mit Doppelfunktion, Grundlänge 30/30, Messing matt vernickelt, 3 Neusilberschlüssel"]
[1400,1400,1400,1400,1400,null,3600,3600,3600,2122,"Profildoppelzylinder, Grundlänge 30/30, Messing matt vernickelt, 3 Neusilberschlüssel"]
[1463,1463,1463,1463,1463,null,3663,3663,3663,2163,"Profildoppelzylinder, mit Not- und Gefahrenfunktion, Grundlänge 30/30, Messing matt vernickelt, 3 Neusilberschlüssel"]
[1408,1408,1408,1408,1408,null,3608,3608,3608,2108,"Profildoppelzylinder, mit Freilauffunktion für Getriebeschlösser (FZG), Grundlänge 30/30, Messing matt vernickelt, 3 Neusilberschlüssel"]
[1478,null,1478,1478,null,null,null,null,null,2178,"Profildoppelzylinder schließbar nur mit beidseitig steckenden verschiedenen Schlüsseln, Grundlänge 30/30, Messing matt vernickelt, 3 Neusilberschlüssel"]
[1479,null,1479,1479,null,null,null,null,null,2179,"Profildoppelzylinder, mit Gefahrenschlüssel-einrichtung, Grundlänge 30/30, Messing matt vernickelt, 3 Neusilberschlüssel"]
[1480,1480,1480,1480,1480,null,3680,3680,3680,2180,"Profildoppelzylinder, Grundlänge 26/26, einseitig blind, Messing matt vernickelt, 3 Neusilberschlüssel"]
[1481,1481,1481,1481,1481,null,3681,3681,3681,2181,"Profildoppelzylinder, Grundlänge 26/30, Messing matt vernickelt, 3 Neusilberschlüssel"]
[1483,1483,1483,1483,1483,null,3683,3683,3683,2183,"Profildoppelzylinder, mit Not- und Gefahrenfunktion, Grundlänge 26/35, Messing matt vernickelt, 3 Neusilberschlüssel"]
[1488,1488,1488,1488,1488,null,3688,3688,3688,2188,"Profilkurzzylinder, Grundlänge 26/26, Messing matt vernickelt, 3 Neusilberschlüssel"]
[1489,1489,1489,1489,null,null,3689,3689,null,2189,"Profildoppelzylinder, Grundlänge 30/30, Messing matt vernickelt, 3 Neusilberschlüssel, eine Seite Notöffnung, andere Seite Schließfunktion"]
["Knaufzylinder"]
[1405,1405,1405,1405,1405,null,3605,3605,3605,2105,"Profilknaufzylinder, Grundlänge 30/30, Messing matt vernickelt, 3 Neusilberschlüssel"]
[1406,1406,1406,1406,1406,null,3606,3606,3606,3606,"Profilknaufzylinder, mit Freilauffunktion für Getriebeschlösser (FZG), Grundlänge 30/30, Messing matt vernickelt, 3 Neusilberschlüssel"]
[1407,1407,1407,1407,1407,null,3607,3607,3607,2107,"Profilknaufzylinder, Grundlänge 26/26, Messing matt vernickelt, 3 Neusilberschlüssel"]
[1484,1484,1484,1484,1484,null,3684,3684,3684,2184,"Profilknaufzylinder, Grundlänge 26/30, Messing matt vernickelt, 3 Neusilberschlüssel"]
[1474,1474,1474,1474,1474,null,null,3674,3674,2174,"Anti-Panik-Profilknaufzylinder, Grundlänge 30/40, für den Einsatz in Anti-Panik-Schlössern, Messing matt vernickelt, 3 Neusilberschlüssel"]
[1475,null,1475,1475,null,null,3675,3675,null,null,"Profilknaufzylinder, mit Anti-Amok-Funktion, Grundlänge 30/30, Messing matt vernickelt, 3 Neusilberschlüssel"]
["Halbzylinder"]
[1312,1312,1312,1312,1312,null,3612,3612,3612,2112,"Profilhalbzylinder, mit frei drehbarem Schließbart, Grundlänge 00/30, Messing matt vernickel, 3 Neusilberschlüssel"]
[1319,1319,1319,1319,1319,null,3619,3619,3619,2119,"Profilhalbzylinder, mit zwei Gewindebohrungen M4 auf der Rückseite, Grundlänge 00/30, Messing matt vernickelt, 3 Neusilberschlüssel"]
[null,null,1398,1398,null,null,null,null,null,null,"Profilhalbzylinder mit Doppelfunktion, Grundlänge 00/30, Messing matt vernickelt, 3 Neusilberschlüssel"]
[1410,1410,1410,1410,1410,null,3610,3610,3610,2110,"Profilhalbzylinder, Grundlänge 00/26, Messing matt vernickelt, 3 Neusilberschlüssel"]
[1415,1415,1415,1415,1415,null,3615,3615,3615,2115,"Profilhalbzylinder, mit Freilauf für Schaltungen, Grundlänge 00/30, Messing matt vernickelt, 3 Neusilberschlüssel"]
["Zylinder gemäß den Richtlinien des                          (nur STR, HSR nicht möglich)"]
[null,null,null,"B400",null,null,null,"B300",null,null,"Profildoppelzylinder, Grundlänge 30/30, Messing matt vernickelt, 3 Neusilberschlüssel, Ausführung VdS BZ"]
[null,null,null,"B405",null,null,null,"B305",null,null,"Profilknaufzylinder, Grundlänge 30/30, Messing matt vernickelt, 3 Neusilberschlüssel, Ausführung VdS BZ"]
[null,null,null,"B410",null,null,null,"B310",null,null,"Profilhalbzylinder, Grundlänge 00/30, Messing matt vernickelt, 3 Neusilberschlüssel, Ausführung VdS BZ"]
[null,null,null,"B463",null,null,null,"B363",null,null,"Profildoppelzylinder, mit Not- und Gefahrenfunktion, Grundlänge 30/30, Messing matt vernickelt, 3 Neusilberschlüssel, Ausführung VdS BZ"]
["Zylinder gemäß den Richtlinien des                          (nur STR, HSR nicht möglich)"]
[null,null,"K400","K400","K400",null,null,"K360","K360",null,"Profildoppelzylinder, Grundlänge 30/30, Messing matt vernickelt, 3 Neusilberschlüssel, ABH SKG einseitig"]
[null,null,"K405","K405","K405",null,null,"K365","K365",null,"Profilknaufzylinder, Grundlänge 30/30, Messing matt vernickelt, 3 Neusilberschlüssel,  ABH SKG einseitig"]
[null,null,"K410","K410","K410",null,null,"K361","K361",null,"Profilhalbzylinder, Grundlänge 00/26, Messing matt vernickelt, 3 Neusilberschlüssel,  ABH SKG einseitig"]
[null,null,"K463","K463","K463",null,null,"K363","K363",null,"Profildoppelzylinder, mit Not- und Gefahrenfunktion, Grundlänge 30/30, Messing matt vernickelt, 3 Neusilberschlüssel,  ABH SKG einseitig"]
["Vorhangschloß"]
[2201,2201,2201,2201,2201,null,3601,3601,3601,2101,"Schweres Vorhangschloß, Schloßkörper Messing gebürstet, 30er oder 80er Niro-Bügel, 3 Neusilberschlüssel"]
["Hebelzylinder"]
[1250,1250,1250,1250,1250,null,3650,3650,3650,2150,"Zylinder-Hebelschloß, Messing matt vernickelt, 3 Neusilberschlüssel"]
[1251,1251,1251,1251,1251,null,3651,3651,3651,2151,"Zylinder-Hebelschloß, Schlüssel im offenem bzw. geschlossenem Zustand abziehbar, Messing matt vernickelt, 3 Neusilberschlüssel"]
[1253,1253,1253,1253,1253,null,3657,3657,3657,2157,"Zylinder-Hebelschloß, Messing matt vernickelt, 3 Neusilberschlüssel, für Renz-Briefkästen, mit Hebel 50 62 059 und Befestigungsrundmutter"]
["Rundzylinder"]
[500,500,500,500,500,null,3652,3652,3652,2152,"Aussenzylinder für Kastenschlösser"]
["500F","500F","500F","500F",null,null,3632,3632,3632,2132,"Rundzylinder Durchmesser 32mm für Garagentore"]
[501,501,501,501,null,null,null,null,null,2155,"Aussenzylinder für Kastenschloss Nr. 2611"]
[503,503,503,503,null,null,3603,3603,null,2103,"Aussenzylinder für Kastenschloss Nr. 2621"]
[560,560,560,560,null,null,3660,3660,null,2160,"Kontaktzylinder für Aufzüge"]
[586,586,586,586,null,null,null,null,null,2154,"Rundzylinder Durchmesser 30mm für Garagentore aus Stahl"]
[587,587,587,587,null,null,null,null,null,2153,"Rundzylinder Durchmesser 30mm für Garagentore aus Holz"]
[2530,2530,2530,2530,null,null,3616,3616,null,2116,"Aussen- und Innenzylinder für Zusatzschloss Nr. 2516"]
[2532,2532,2532,2532,null,null,3624,3624,null,2124,"Aussen- und Innenzylinder für Kastenschloss Nr. 542 und Nr. 2524"]
[2534,2534,2534,2534,null,null,3656,3656,null,2156,"Aussen- und Innenzylinder für Nr. 2616"]
[2613,2613,2613,2613,null,null,3613,3613,null,2113,"Aussen- und Innenzylinder für Nr. 2626"]
["Zylinder für Möbelschlösser"]
[593,593,593,593,null,null,null,3693,null,2193,"Möbelschloss-Rundzylinder, Durchmesser 23mm, für Nr. 592"]
[598,598,598,598,null,null,null,3694,null,2198,"Zylinder für Durchsteckmontage, nur verwendbar für Nr. 546, 548 und 549"]
[692,692,692,692,null,null,null,3695,null,2192,"Möbelschloss-Rundzylinder, Durchmesser 30mm, für Nr. 592"]
[550,550,550,550,null,null,null,550,null,550,"Dreh- und verschließbare Olive, mit Zylinder 597, für Nr. 546, 548 und 549"]
["Möbelschlösser und Zubehör"]
[546,546,546,546,null,null,null,546,null,546,"Möbelriegelschloss 40mm Dorn"]
[548,548,548,548,null,null,null,548,null,548,"Drehstangenschloss 40mm Dorn für geteilte Drehstangen"]
[549,549,549,549,null,null,null,549,null,549,"Drehstangenschloss 25mm Dorn für geteilte Drehstangen"]
[592,592,592,592,null,null,null,592,null,592,"Aufliegendes Möbelriegelschloss 25-50mm Dorn"]
[520,520,520,520,null,null,null,520,null,520,"feststehende Olive, matt vernickelt"]
[530,530,530,530,null,null,null,530,null,530,"drehbare Olive, matt vernickelt"]
["Zylinder ohne Schließfunktion"]
[1304,1304,1304,1304,1304,1304,1304,1304,1304,1304,"Knaufzylinder, beidseitig Knauf, Messing matt vernickelt"]
[1307,1307,1307,1307,1307,1307,1307,1307,1307,1307,"Knaufzylinder, asymetrisch, beidseitig Knauf, Messing matt vernickelt"]
[1380,1380,1380,1380,1380,1380,1380,1380,1380,1380,"Knaufzylinder, einseitig Knauf, andere Seite blind, Messing matt vernickelt"]
[1401,1401,1401,1401,1401,1401,1401,1401,1401,1401,"Profilblindzylinder, Grundlänge 26/26 oder 00/26, Messing matt vernickelt"]
[1413,1413,1413,1413,1413,1413,1413,1413,1413,1413,"Knaufhalbzylinder, Grundlänge 00/30, Messing matt vernickelt"]
[1477,1477,1477,1477,1477,1477,1477,1477,1477,1477,"Knaufzylinder mit optischer Verschlussanzeige, Grundlänge 30/30, Messing matt vernickelt"]
[1482,1482,1482,1482,1482,1482,1482,1482,1482,1482,"Doppelzylinder, Grundlänge 30/30, Messing matt vernickelt, einseitig blind, andere Seite Notöffnung"]
[1486,1486,1486,1486,1486,1486,1486,1486,1486,1486,"Doppelzylinder, Grundlänge 30/30, Messing matt vernickelt, beidseitig Notöffnung"]
[1487,1487,1487,1487,1487,1487,1487,1487,1487,1487,"Knaufzylinder, Grundlänge 30/30, Messing matt vernickelt, einseitig Notöffnung, andere Seite Knauf"]
["Zylinderfärbungen",null,null,null,null,null,null,null,null,null,"Code (Schließplan Spalte Färbung)","Beschreibung"]
["X","X","X","X","X","X","X","X","X","X","1","Messing matt vernickelt (Standard)"]
["X","X","X","X","X","X","X","X","X","X","3","Messing poliert"]
["X","X","X","X","X","X","X","X","X","X","4","Messing matt gebürstet"]
["X","X","X","X","X","X","X","X","X","X","5","Messing brüniert"]
["X","X","X","X","X","X","X","X","X","X","6","Messing matt verchromt"]
["X","X","X","X","X","X","X","X","X","X","7","Messing poliert verchromt"]
["Zusatzausstattungen für mechanische Schließanlagen (Auszug)",null,null,null,null,null,null,null,null,null,"Code (Schließplan Spalte ZAS)","Beschreibung"]
["X","X","X","X","X",null,"X","X",null,null,"01","seewasserbeständige Ausführung"]
["X","X","X","X","X",null,null,null,null,null,"03"," verschleissarme Ausführung"]
["X","X","X","X","X",null,"X","X","X","X","04","Knauf kurze Seite"]
["X","X","X","X","X",null,"X","X","X","X","05","Knauf lange Seite"]
["X",null,"X",null,null,null,null,null,null,null,"08","Gefahrenschlüssel kurze Seite"]
["X",null,"X",null,null,null,null,null,null,null,"09","Gefahrenschlüssel lange Seite"]
["X","X","X","X","X",null,null,null,null,null,"3","ABH I beidseitig"]
["X","X","X","X","X",null,null,null,null,"X","4","ABH III kurze Seite"]
["X","X","X","X","X",null,null,null,null,"X","5","ABH III lange Seite"]
["X","X","X","X","X",null,null,null,null,"X","6","ABH III beidseitig"]
["X","X","X","X","X",null,null,null,null,null,"65","ABH V beidseitig"]
["X","X","X","X","X",null,null,null,null,null,"45"," ABH V kurze Seite"]
["X","X","X","X","X",null,null,null,null,null,"55","ABH V lange Seite"]
[null,null,null,"X","X",null,"X","X","X",null,"77","SKG-ABH kurze Seite"]
[null,null,null,"X","X",null,"X","X","X",null,"78","SKG-ABH lange Seite"]
[null,null,null,"X","X",null,"X","X","X",null,"79","SKG-ABH beidseitig"]
[null,null,null,null,null,null,"X","X","X",null,"81","ABH IX kurze Seite"]
[null,null,null,null,null,null,"X","X","X",null,"82","ABH IX lange Seite"]
[null,null,null,null,null,null,"X","X","X",null,"83","ABH IX beidseitig"]
[null,null,null,null,null,null,"X","X","X",null,"91","ABH X kurze Seite"]
[null,null,null,null,null,null,"X","X","X",null,"92","ABH X lange Seite"]
[null,null,null,null,null,null,"X","X","X",null,"93"," ABH X beidseitig"]
[null,null,"X",null,null,null,null,null,null,null,"7","PRO für Halbzylinder und Knaufzylinder"]
[null,null,"X",null,null,null,null,null,null,null,"8","PRO für Doppelzylinder"]
[null,null,null,"X","X",null,"X","X","X",null,"A1","Ziehschutzspange"]
["X","X","X","X","X",null,"X","X","X","X","S2","Biffar-Schließnase"]
["X","X","X","X","X",null,"X","X","X","X","S3","Ritzel 10 Zähne (Multilock)"]
["X","X","X","X","X",null,"X","X","X","X","S4","Ritzel 18 Zähne"]
["elektronische Zylinder, Leser und Beschläge \"Serie easy\""]
["E204","E204","E204","E204","E204","E204","E204","E204","E204","E204","Elektronischer Doppelknaufzylinder, Serie easy2.0, Grundlänge 30/30, Messing matt vernickelt, aussen Elektronik, innen mechanischer Knauf, IP67"]
["E203","E203","E203","E203","E203","E203","E203","E203","E203","E203","Elektronischer Doppelknaufzylinder, Serie easy2.0, Grundlänge 30/30, Messing matt vernickelt, aussen Elektronik, innen Blindkern, IP67"]
["E207","E207","E207","E207","E207","E207","E207","E207","E207","E207","Elektronischer Doppelknaufzylinder, Serie easy2.0, Grundlänge 30/30, Messing matt vernickelt, beidseitig Elektronik, IP67"]
["E213","E213","E213","E213","E213","E213","E213","E213","E213","E213","Elektronischer Halbzylinder, Serie easy2.0, Grundlänge 00/30, Messing matt vernickelt, aussen Elektronik, IP67"]
["E214","E214","E214","E214","E214","E214","E214","E214","E214","E214","Elektronischer Doppelknaufzylinder, für Anti-Panik-Türen, Serie easy2.0, Grundlänge 30/35, Messing matt vernickelt, aussen Elektronik, innen mechanischer Knauf, IP67"]
["E215","E215","E215","E215","E215","E215","E215","E215","E215","E215","Elektronischer Doppelknaufzylinder, für Anti-Panik-Türen, Serie easy2.0, Grundlänge 30/35, Messing matt vernickelt, aussen Elektronik, innen Blindkern, IP67"]
["E831","E831","E831","E831","E831","E831","E831","E831","E831","E831","Elektronikleser, schmale Abdeckkappe"]
["E832","E832","E832","E832","E832","E832","E832","E832","E832","E832","Elektronikleser, breite Abdeckkappe"]
["E820","E820","E820","E820","E820","E820","E820","E820","E820","E820","Elektronischer Beschlag"]
["E821","E821","E821","E821","E821","E821","E821","E821","E821","E821","Elektronischer Beschlag, für den Einsatz in Brand- und Rauchschutztüren."]
["E931","E931","E931","E931","E931","E931","E931","E931","E931","E931","Elektronikleser, schmale Abdeckkappe System \"elink\""]
["E932","E932","E932","E932","E932","E932","E932","E932","E932","E932","Elektronikleser, breite Abdeckkappe System \"elink\""]
["E935","E935","E935","E935","E935","E935","E935","E935","E935","E935","Zusatzleser, schmale Abdeckkappe System \"elink\""]
["E936","E936","E936","E936","E936","E936","E936","E936","E936","E936","Zusatzleser, breite Abdeckkappe System \"elink\""]
["E920","E920","E920","E920","E920","E920","E920","E920","E920","E920","Elektronischer Beschlag"]
["E921","E921","E921","E921","E921","E921","E921","E921","E921","E921","Elektronischer Beschlag, für den Einsatz in Brand- und Rauchschutztüren."]
["Zubehör elektronische Zylinder, Leser und Beschläge \"Serie easy\""]
["E837","E837","E837","E837","E837","E837","E837","E837","E837","E837","Aufputzgehäuse für Lesersteuerung weiß"]
["E850","E850","E850","E850","E850","E850","E850","E850","E850","E850","Software mit tragbarem Programmiergerät, inkl. USB-Anschlusskabel"]
["E855","E855","E855","E855","E855","E855","E855","E855","E855","E855","Hotel-Software, inkl. Kodierstation"]
["E950","E950","E950","E950","E950","E950","E950","E950","E950","E950","elink-Software, inkl. Programmiergerät"]
["E895","E895","E895","E895","E895","E895","E895","E895","E895","E895","Programmierkarte"]
["E871","E871","E871","E871","E871","E871","E871","E871","E871","E871","Notöffnungsadapter (inkl. 4 Batterien)"]
["SE24","SE24","SE24","SE60","SE65","SE66","SE37","SE36","SE35","E241","Elektronikschlüssel"]
["E890","E890","E890","E890","E890","E890","E890","E890","E890","E890","Schlüsselhalter Tacky (mind. Bestellmenge 5 Stück)"]
["E891","E891","E891","E891","E891","E891","E891","E891","E891","E891","Schlüsselanhänger-Transponder"]
["E892","E892","E892","E892","E892","E892","E892","E892","E892","E892","Schlüsselanhänger-Transponder Komfort-Ausführung"]
["E894","E894","E894","E894","E894","E894","E894","E894","E894","E894","Transponderkarte"]
["E896","E896","E896","E896","E896","E896","E896","E896","E896","E896","Transponderscheibe transparent oder selbstklebend weiß"]
["E898","E898","E898","E898","E898","E898","E898","E898","E898","E898","Schlüsselanhänger in verschiedenen Ausführungen, Standard+, Premium, Elegant (mind. Bestellmenge 5 Stück)"]
["E624ST","E624ST","E624ST","E624ST","E624ST","E624ST","E624ST","E624ST","E624ST","E624ST","Steckernetzteil für externe Versorgung von Leser und Zylinder"]
["E624UP","E624UP","E624UP","E624UP","E624UP","E624UP","E624UP","E624UP","E624UP","E624UP","Netzteil für Einbau in UP-Dose für externe Versorgung von Leser und Zylinder"]
["E680","E680","E680","E680","E680","E681","E682","E680","E680","E680","Kabelübergang, galvanisch verchromt"]
["Zusatzausstattungen für elektronische Schließanlagen (Auszug)",null,null,null,null,null,null,null,null,null,"Code (Schließplan Spalte ZAS)","Beschreibung"]
["X","X","X","X","X",null,null,"X","X","X","V","verlängerte Achse"]
["Motorzylinder MZ02"]
[null,"M550","M550","M550","M550",null,null,"M550","M550",null,"Motorzylinder MZ02, Grundlänge 30/30, inkl. Steuerung, Netzteil, Kabel und Türkontakt, matt vernickelt"]
[null,"M551","M551","M551","M551",null,null,"M551","M551",null,"Motorzylinder MZ02, Grundlänge 30/30, inkl. Steuerung, Netzteil, Kabel und Türkontakt, F1 ähnlich"]
[null,"M552","M552","M552","M552",null,null,"M552","M552",null,"Motorzylinder MZ02, Grundlänge 30/30, inkl. Steuerung, Netzteil, Kabel und Türkontakt, Edelstahl ähnlich"]
[null,"M553","M553","M553","M553",null,null,"M553","M553",null,"Motorzylinder MZ02, Grundlänge 30/30, inkl. Steuerung, Netzteil, Kabel und Türkontakt, Messing poliert"]
["M554","M554","M554","M554","M554",null,null,"M554","M554","M554","Motorzylinder MZ02, Grundlänge 30/30, inkl. Steuerung, Netzteil, Kabel und Türkontakt, matt vernickelt, mit Blindzylinder"]
["M555","M555","M555","M555","M555",null,null,"M555","M555","M555","Motorzylinder MZ02, Grundlänge 30/30, inkl. Steuerung, Netzteil, Kabel und Türkontakt, F1 ähnlich, mit Blindzylinder"]
["M556","M556","M556","M556","M556",null,null,"M556","M556","M556","Motorzylinder MZ02, Grundlänge 30/30, inkl. Steuerung, Netzteil, Kabel und Türkontakt, Edelstahl ähnlich, mit Blindzylinder"]
["M557","M557","M557","M557","M557",null,null,"M557","M557","M557","Motorzylinder MZ02, Grundlänge 30/30, inkl. Steuerung, Netzteil, Kabel und Türkontakt, Messing poliert, mit Blindzylinder"]
[null,"M558","M558","M558","M558",null,null,"M558","M558",null,"Motorzylinder MZ02, Grundlänge 30/30, inkl. Steuerung, Netzteil, Kabel und Türkontakt, matt vernickelt, ohne Innenknauf"]
["Zubehör Motorzylinder MZ02"]
["M540","M540","M540","M540","M540",null,null,"M540","M540","M540","Wochenzeitschaltuhr für MZ02"]
["M541","M541","M541","M541","M541",null,null,"M541","M541","M541","Warntonsirene"]

{"sheet":"Mechanisch","index":4,"n_rows":13,"n_cols":69,"rows_kept":13,"cut":false,"hidden":true,"merged":[[0,57,2,57],[0,58,2,58],[0,59,2,59],[0,60,2,60],[0,62,2,62],[13,121,13,130],[13,132,13,135],[14,69,15,69],[0,67,2,67],[0,68,2,68],[14,93,14,97],[14,98,14,102],[13,93,13,102],[14,105,14,111],[14,112,14,118],[13,105,13,118],[14,121,14,125],[14,126,14,130],[14,80,14,84],[14,85,14,89],[0,18,2,18],[0,19,2,19],[0,40,2,40],[0,41,2,41],[0,42,2,42],[0,37,2,37],[0,38,2,38],[0,39,2,39],[0,20,2,20],[0,21,2,21],[0,22,2,22],[0,35,2,35],[0,36,2,36],[0,28,2,28],[0,23,2,23],[0,24,2,24],[0,25,2,25],[0,26,2,26],[0,27,2,27],[0,29,2,29],[0,30,2,30],[0,31,2,31],[0,32,2,32],[0,33,2,33],[0,9,2,9],[0,10,2,10],[0,11,2,11],[0,12,2,12],[0,13,2,13],[0,14,2,14],[0,15,2,15],[0,16,2,16],[0,17,2,17],[0,0,2,0],[0,1,2,1],[0,2,2,2],[0,3,2,3],[0,4,2,4],[0,5,2,5],[0,6,2,6],[0,7,2,7],[0,8,2,8],[0,34,2,34],[0,44,2,44],[0,45,2,45],[0,46,2,46],[0,47,2,47],[0,43,2,43],[0,61,2,61],[14,208,15,208],[14,209,15,209],[0,51,2,51],[0,52,2,52],[0,53,2,53],[0,54,2,54],[0,48,2,48],[0,49,2,49],[0,50,2,50],[0,55,2,55],[0,63,2,63],[13,140,13,150],[13,153,13,166],[0,64,2,64],[0,65,2,65],[0,66,2,66],[0,56,2,56],[14,192,15,192],[14,193,15,193],[14,194,15,194],[14,190,15,190],[14,191,15,191],[14,140,14,144],[14,146,14,150],[14,153,14,159],[14,160,14,166],[14,211,15,211],[14,212,15,212],[14,195,15,195],[14,196,15,196],[14,197,15,197],[14,198,15,198],[14,199,15,199],[14,200,15,200],[14,201,15,201],[14,207,15,207],[14,210,15,210]]}
[null,"Profildoppelzylinder mit Doppelfunktion, Grundlänge 30/30, Messing matt vernickelt, 3 Neusilberschlüssel","Profildoppelzylinder, Grundlänge 30/30, Messing matt vernickelt, 3 Neusilberschlüssel","Profildoppelzylinder, mit Not- und Gefahrenfunktion, Grundlänge 30/30, Messing matt vernickelt, 3 Neusilberschlüssel","Profildoppelzylinder, Freilaufzylinder für Getriebeschlösser, Grundlänge 30/30, Messing matt vernickelt, 3 Neusilberschlüssel","Profildoppelzylinder schließbar nur mit beidseitig steckenden verschiedenen Schlüsseln, Grundlänge 30/30, Messing matt vernickelt, 3 Neusilberschlüssel","Profildoppelzylinder, mit Gefahrenschlüssel-einrichtung, Grundlänge 30/30, Messing matt vernickelt, 3 Neusilberschlüssel","Profildoppelzylinder, Grundlänge 26/26, einseitig blind, Messing matt vernickelt, 3 Neusilberschlüssel","Profildoppelzylinder, Grundlänge 26/30, Messing matt vernickelt, 3 Neusilberschlüssel","Profildoppelzylinder, mit Not- und Gefahrenfunktion, Grundlänge 26/35, Messing matt vernickelt, 3 Neusilberschlüssel","Profilkurzzylinder, Grundlänge 26/26, Messing matt vernickelt, 3 Neusilberschlüssel","Profildoppelzylinder, Grundlänge 30/30, Messing matt vernickelt, 3 Neusilberschlüssel, eine Seite Notöffnung, andere Seite Schließfunktion","Profilknaufzylinder, Grundlänge 30/30, Messing matt vernickelt, 3 Neusilberschlüssel","Profilknaufzylinder, Freilaufzylinder für Getriebeschlösser, Grundlänge 30/30, Messing matt vernickelt, 3 Neusilberschlüssel","Profilknaufzylinder, Grundlänge 26/26, Messing matt vernickelt, 3 Neusilberschlüssel","Profilknaufzylinder, Grundlänge 26/30, Messing matt vernickelt, 3 Neusilberschlüssel","Profilknaufzylinder, Grundlänge","Profilknaufzylinder, mit Anti-Amok-Funktion, Grundlänge 30/30, Messing matt vernickelt, 3 Neusilberschlüssel","Profilhalbzylinder, mit frei drehbarem Schließbart, Grundlänge 00/30, Messing matt vernickel, 3 Neusilberschlüssel","Profilhalbzylinder, mit zwei Gewindebohrungen M4 auf der Rückseite, Grundlänge 00/30, Messing matt vernickelt, 3 Neusilberschlüssel","Profilhalbzylinder mit Doppelfunktion, Grundlänge 00/30, Messing matt vernickelt, 3 Neusilberschlüssel","Profilhalbzylinder, Grundlänge 00/26, Messing matt vernickelt, 3 Neusilberschlüssel","Profilhalbzylinder, mit Freilauf für Schaltungen, Grundlänge 00/30, Messing matt vernickelt, 3 Neusilberschlüssel","Profildoppelzylinder, Grundlänge 30/30, Messing matt vernickelt, 3 Neusilberschlüssel, Ausführung VdS AZ","Profilknaufzylinder, Grundlänge 30/30, Messing matt vernickelt, 3 Neusilberschlüssel, Ausführung VdS AZ","Profilhalbzylinder, Grundlänge 00/26, Messing matt vernickelt, 3 Neusilberschlüssel, Ausführung VdS AZ","Profildoppelzylinder, mit Not- und Gefahrenfunktion, Grundlänge 30/30, Messing matt vernickelt, 3 Neusilberschlüssel, Ausführung VdS AZ","Profildoppelzylinder, Grundlänge 30/30, Messing matt vernickelt, 3 Neusilberschlüssel, Ausführung VdS BZ","Profilknaufzylinder, Grundlänge 30/30, Messing matt vernickelt, 3 Neusilberschlüssel, Ausführung VdS BZ","Profilhalbzylinder, Grundlänge 00/26, Messing matt vernickelt, 3 Neusilberschlüssel, Ausführung VdS BZ","Profildoppelzylinder, mit Not- und Gefahrenfunktion, Grundlänge 30/30, Messing matt vernickelt, 3 Neusilberschlüssel, Ausführung VdS BZ","Profildoppelzylinder, Grundlänge 30/30, Messing matt vernickelt, 3 Neusilberschlüssel, ABH SKG einseitig","Profilknaufzylinder, Grundlänge 30/30, Messing matt vernickelt, 3 Neusilberschlüssel,  ABH SKG einseitig","Profilhalbzylinder, Grundlänge 00/26, Messing matt vernickelt, 3 Neusilberschlüssel,  ABH SKG einseitig","Profildoppelzylinder, mit Not- und Gefahrenfunktion, Grundlänge 30/30, Messing matt vernickelt, 3 Neusilberschlüssel,  ABH SKG einseitig","Schweres Vorhangschloß, Schloßkörper Messing gebürstet, 30er oder 80er Niro-Bügel, 3 Neusilberschlüssel","Zylinder-Hebelschloß, Messing matt vernickelt, 3 Neusilberschlüssel","Zylinder-Hebelschloß, Schlüssel im offenem bzw. geschlossenem Zustand abziehbar, Messing matt vernickelt, 3 Neusilberschlüssel","Zylinder-Hebelschloß, Messing matt vernickelt, 3 Neusilberschlüssel, für Renz-Briefkästen, mit Hebel 50 62 059 und Befestigungsrundmutter","Aussenzylinder für Kastenschlösser","Rundzylinder Durchmesser 32mm für Garagentore","Aussenzylinder für Kastenschloss Nr. 2611","Aussenzylinder für Kastenschloss Nr. 2621","Kontaktzylinder für Aufzüge","Rundzylinder Durchmesser 30mm für Garagentore aus Stahl","Rundzylinder Durchmesser 30mm für Garagentore aus Holz","Aussen- und Innenzylinder für Zusatzschloss Nr. 2516","Aussen- und Innenzylinder für Kastenschloss Nr. 542 und Nr. 2524","Aussen- und Innenzylinder für Nr. 2616","Aussen- und Innenzylinder für Nr. 2626","Möbelschloss-Rundzylinder, Durchmesser 23mm, für Nr. 592","Zylinder für Durchsteckmontage, nur verwendbar für Nr. 546, 548 und 549","Möbelschloss-Rundzylinder, Durchmesser 30mm, für Nr. 592","Dreh- und verschließbare Olive, mit Zylinder 597, für Nr. 546, 548 und 549","Möbelriegelschloss 40mm Dorn","Drehstangenschloss 40mm Dorn für geteilte Drehstangen","Drehstangenschloss 25mm Dorn für geteilte Drehstangen","Aufliegendes Möbelriegelschloss 25-50mm Dorn","feststehende Olive, matt vernickelt","drehbare Olive, matt vernickelt","Knaufzylinder, beidseitig Knauf, Messing matt vernickelt","Knaufzylinder, asymetrisch, beidseitig Knauf, Messing matt vernickelt","Knaufzylinder, Knauf/blind, Messing matt vernickelt","Profilblindzylinder, Grundlänge 26/26 oder 00/26, Messing matt vernickelt","Knaufhalbzylinder, Grundlänge 00/30, Messing matt vernickelt","Knaufzylinder mit optischer Verschlussanzeige, Grundlänge 30/30, Messing matt vernickelt","Doppelzylinder, Grundlänge 30/30, Messing matt vernickelt, einseitig blind, andere Seite Notöffnung","Doppelzylinder, Grundlänge 30/30, Messing matt vernickelt, beidseitig Notöffnung","Knaufzylinder, Grundlänge 30/30, Messing matt vernickelt, einseitig Notöffnung, andere Seite Knauf"]
[]
[]
["Standard",null,1400,1463,1408,1478,1479,1480,1481,1483,1488,1489,1405,1406,1407,1484,1474,1475,1312,1319,null,1410,1415,null,null,null,null,null,null,null,null,null,null,null,null,2201,1250,1251,1253,500,"500F",501,503,560,586,587,2530,2532,2534,2613,593,598,692,550,546,548,549,592,520,530,1304,1307,1380,1401,1413,1477,1482,1486,1487]
["CARAT",null,1400,1463,1408,null,null,1480,1481,1483,1488,1489,1405,1406,1407,1484,1474,null,1312,1319,null,1410,1415,null,null,null,null,null,null,null,null,null,null,null,null,2201,1250,1251,1253,500,"500F",501,503,560,586,587,2530,2532,2534,2613,593,598,692,550,546,548,549,592,520,530,1304,1307,1380,1401,1413,1477,1482,1486,1487]
["HSR",1399,1400,1463,1408,1478,1479,1480,1481,1483,1488,1489,1405,1406,1407,1484,1474,1475,1312,1319,1398,1410,1415,null,null,null,null,null,null,null,null,null,null,null,null,2201,1250,1251,1253,500,"500F",501,503,560,586,587,2530,2532,2534,2613,593,598,692,550,546,548,549,592,520,530,1304,1307,1380,1401,1413,1477,1482,1486,1487]
["STR",1399,1400,1463,1408,1478,1479,1480,1481,1483,1488,1489,1405,1406,1407,1484,1474,1475,1312,1319,1398,1410,1415,"A400","A405","A410","A463","B400","B405","B410","B463","K400","K405","K410","K463",2201,1250,1251,1253,500,"500F",501,503,560,586,587,2530,2532,2534,2613,593,598,692,550,546,548,549,592,520,530,1304,1307,1380,1401,1413,1477,1482,1486,1487]
["TH6",1399,1400,1463,1408,1478,1479,1480,1481,1483,1488,1489,1405,1406,1407,1484,1474,1475,1312,1319,1398,1410,1415,null,null,null,null,"B400","B405","B410","B463","K400","K405","K410","K463",2201,1250,1251,1253,500,"500F",501,503,560,586,587,2530,2532,2534,2613,593,598,692,550,546,548,549,592,520,530,1304,1307,1380,1401,1413,1477,1482,1486,1487]
["CARAT P1",null,1400,1463,1408,null,null,1480,1481,1483,1488,null,1405,1406,1407,1484,1474,null,1312,1319,null,1410,1415,null,null,null,null,null,null,null,null,"K400","K405","K410","K463",2201,1250,1251,1253,500,null,null,null,null,null,null,null,null,null,null,null,null,null,null,null,null,null,null,null,null,1304,1307,1380,1401,1413,1477,1482,1486,1487]
["2VE",null,3600,3663,3608,null,null,3680,3681,3683,3688,3689,3605,3606,3607,3684,null,3675,3612,3619,null,3610,3615,null,null,null,null,null,null,null,null,null,null,null,null,3601,3650,3651,3657,3652,3632,null,3603,3660,null,null,3616,3624,3656,3613,null,null,null,null,null,null,null,null,null,null,1304,1307,1380,1401,1413,1477,1482,1486,1487]
["3VE",null,3600,3663,3608,null,null,3680,3681,3683,3688,3689,3605,3606,3607,3684,3674,3675,3612,3619,null,3610,3615,null,null,null,null,"B300","B305","B310","B363","K360","K365","K361","K363",3601,3650,3651,3657,3652,3632,null,3603,3660,null,null,3616,3624,3656,3613,3693,3694,3695,550,546,548,549,592,520,530,1304,1307,1380,1401,1413,1477,1482,1486,1487]
["CARAT P3",null,3600,3663,3608,null,null,3680,3681,3683,3688,null,3605,3606,3607,3684,3674,null,3612,3619,null,3610,3615,null,null,null,null,null,null,null,null,"K360","K365","K361","K363",3601,3650,3651,3657,3652,3632,null,null,null,null,null,null,null,null,null,null,null,null,null,null,null,null,null,null,null,1304,1307,1380,1401,1413,1477,1482,1486,1487]
["WZ",null,2122,2163,2108,2178,2179,2180,2181,2183,2188,2189,2105,2106,2107,2184,2174,null,2112,2119,null,2110,2115,null,null,null,null,null,null,null,null,null,null,null,null,2101,2150,2151,2157,2152,2132,2155,2103,2160,2154,2153,2116,2124,2156,2113,2193,2198,2192,550,546,548,549,592,520,530,1304,1307,1380,1401,1413,1477,1482,1486,1487]

{"sheet":"Elektronik","index":5,"n_rows":13,"n_cols":45,"rows_kept":13,"cut":false,"hidden":true,"merged":[[0,17,2,17],[0,11,2,11],[0,12,2,12],[0,29,2,29],[0,31,2,31],[0,32,2,32],[0,33,2,33],[0,30,2,30],[0,20,2,20],[0,27,2,27],[0,28,2,28],[0,21,2,21],[0,22,2,22],[0,23,2,23],[0,24,2,24],[0,26,2,26],[0,25,2,25],[0,3,2,3],[0,2,2,2],[0,1,2,1],[0,18,2,18],[0,19,2,19],[0,9,2,9],[0,15,2,15],[0,6,2,6],[0,10,2,10],[0,16,2,16],[0,5,2,5],[0,4,2,4],[0,7,2,7],[0,8,2,8],[0,13,2,13],[0,14,2,14]]}
[null,"Elektronischer Doppelknaufzylinder, Serie easy2.0","Elektronischer Doppelknauf blind","Elektronischer Doppelknauf beidseitig E","Elektronischer Halbzylinder","Elektronischer Panikzylinder","Elektronischer Panikzyl. Blind","Elektronikleser, schmale Abdeckkappe","Elektronikleser, breite Abdeckkappe","Elektronischer Beschlag","Elektronischer Beschlag Brand","Elektronikleser, schmale Abdeckkappe System \"elink\"","Elektronikleser, breite Abdeckkappe System \"elink\"","Zusatzleser, schmale Abdeckkappe System \"elink\"","Zusatzleser, breite Abdeckkappe System \"elink\"","Elektronischer Beschlag","Elektronischer Beschlag Brand","Geschlossene Abdeckkappe Nirosta für Innenknauf (nur E804, E808, E904 und E908)","Aufputzgehäuse für Lesersteuerung weiß","Software mit tragbarem Programmiergerät, inkl. USB-Anschlusskabel","Hotel-Software, inkl. Kodierstation","elink-Software, inkl. Programmiergerät","Programmierkarte","Notöffnungsadapter (inkl. 4 Batterien)","Elektronikschlüssel","Tacky","Schlüsselanhänger-Transponder","Schlüsselanhänger-Transponder Komfort-Ausführung","Transponderkarte","Transponderscheibe transparent oder selbstklebend weiß","Sonderanhänger","Steckernetzteil für externe Versorgung von Leser und Zylinder","Netzteil für Einbau in UP-Dose für externe Versorgung von Leser und Zylinder","Kabelübergang, galvanisch verchromt"]
[]
[]
["Standard","E204","E203","E207","E213","E214","E215","E831","E832","E820","E821","E931","E932","E935","E936","E920","E821","E881","E837","E850","E855","E950","E895","E871","SE24","E890","E891","E892","E894","E896","E898","E624ST","E624UP","E680",null,null,null,null,"M554","M555","M556","M557",null,"M540","M541"]
["CARAT","E204","E203","E207","E213","E214","E215","E831","E832","E820","E821","E931","E932","E935","E936","E920","E821","E881","E837","E850","E855","E950","E895","E871","SE24","E890","E891","E892","E894","E896","E898","E624ST","E624UP","E680","M550","M551","M552","M553","M554","M555","M556","M557","M558","M540","M541"]
["HSR","E204","E203","E207","E213","E214","E215","E831","E832","E820","E821","E931","E932","E935","E936","E920","E821","E881","E837","E850","E855","E950","E895","E871","SE24","E890","E891","E892","E894","E896","E898","E624ST","E624UP","E680","M550","M551","M552","M553","M554","M555","M556","M557","M558","M540","M541"]
["STR","E204","E203","E207","E213","E214","E215","E831","E832","E820","E821","E931","E932","E935","E936","E920","E821","E881","E837","E850","E855","E950","E895","E871","SE24","E890","E891","E892","E894","E896","E898","E624ST","E624UP","E680","M550","M551","M552","M553","M554","M555","M556","M557","M558","M540","M541"]
["TH6","E204","E203","E207","E213","E214","E215","E831","E832","E820","E821","E931","E932","E935","E936","E920","E821","E881","E837","E850","E855","E950","E895","E871","SE60","E890","E891","E892","E894","E896","E898","E624ST","E624UP","E680","M550","M551","M552","M553","M554","M555","M556","M557","M558","M540","M541"]
["CARAT P1","E204","E203","E207","E213","E214","E215","E831","E832","E820","E821","E931","E932","E935","E936","E920","E821","E881","E837","E850","E855","E950","E895","E871","SE65","E890","E891","E892","E894","E896","E898","E624ST","E624UP","E680","M550","M551","M552","M553","M554","M555","M556","M557","M558","M540","M541"]
["2VE","E204","E203","E207","E213","E214","E215","E831","E832","E820","E821","E931","E932","E935","E936","E920","E821","E881","E837","E850","E855","E950","E895","E871","SE37","E890","E891","E892","E894","E896","E898","E624ST","E624UP","E680"]
["3VE","E204","E203","E207","E213","E214","E215","E831","E832","E820","E821","E931","E932","E935","E936","E920","E821","E881","E837","E850","E855","E950","E895","E871","SE36","E890","E891","E892","E894","E896","E898","E624ST","E624UP","E680","M550","M551","M552","M553","M554","M555","M556","M557","M558","M540","M541"]
["CARAT P3","E204","E203","E207","E213","E214","E215","E831","E832","E820","E821","E931","E932","E935","E936","E920","E821","E881","E837","E850","E855","E950","E895","E871","SE35","E890","E891","E892","E894","E896","E898","E624ST","E624UP","E680","M550","M551","M552","M553","M554","M555","M556","M557","M558","M540","M541"]
["WZ","E204","E203","E207","E213","E214","E215","E831","E832","E820","E821","E931","E932","E935","E936","E920","E821","E881","E837","E850","E855","E950","E895","E871","E241","E890","E891","E892","E894","E896","E898","E624ST","E624UP","E680",null,null,null,null,"M554","M555","M556","M557",null,"M540","M541"]